program: Orca
programVersion: 5.0.2
elementType: O O O C C C C C C C C C C C C C C C C C C C C C C C H H H H H H H H H H H H H H H H H H H H H H H H H H
charge: 0
multiplicity: 1
keywords: wb97x-d3
keywords: def2-TZVPP
keywords: def2/J RIJCOSX
keywords: DEFGRID2
keywords: scfconv7
keywords: smallprint printgap noloewdin
keywords: NOSOSCF
formula: C23H26O3
InChI: InChI=1/C23H26O3/c1-16(2)13-20-21(23(20,3)4)22(24)25-15-17-9-8-12-19(14-17)26-18-10-6-5-7-11-18/h5-14,20-21H,15H2,1-4H3
52 atoms
O  -1.133801 -0.006267 1.988626
O  -2.719214 1.229698 1.006433
O  3.670835 0.948675 -0.267256
C  -4.15455 -1.433051 0.360731
C  -3.121595 -1.297142 -0.705071
C  -2.723595 -1.15679 0.768369
C  -4.639207 -2.832303 0.666319
C  -5.238428 -0.395549 0.522979
C  -3.078434 -0.139528 -1.631774
C  -2.239498 0.153926 1.246045
C  -1.974309 0.331675 -2.21065
C  -2.017373 1.508473 -3.135275
C  -0.608407 -0.230649 -1.964897
C  -0.446097 1.176424 2.396124
C  0.433022 1.696164 1.292923
C  1.640139 1.056963 1.031988
C  0.047897 2.78375 0.517803
C  2.454063 1.501353 -0.000941
C  0.873993 3.228983 -0.50351
C  2.072085 2.58875 -0.774854
C  3.85852 -0.398041 -0.159528
C  2.917345 -1.319521 -0.603596
C  5.070075 -0.827319 0.36345
C  3.19829 -2.673709 -0.512728
C  5.34129 -2.184598 0.438789
C  4.406705 -3.114279 0.007168
H  -2.780056 -2.234606 -1.137334
H  -2.183247 -1.998957 1.185412
H  -5.003937 -2.904815 1.692462
H  -3.851204 -3.576254 0.540669
H  -5.45998 -3.106885 0.001187
H  -5.61118 -0.395335 1.548546
H  -6.078247 -0.642863 -0.129608
H  -4.913792 0.614019 0.293001
H  -4.022177 0.348929 -1.850644
H  -1.400022 2.322017 -2.744988
H  -3.029674 1.888247 -3.26909
H  -1.617555 1.255203 -4.120548
H  -0.142806 -0.547599 -2.90202
H  -0.613912 -1.08124 -1.285259
H  0.041882 0.536288 -1.535277
H  0.155091 0.868686 3.251615
H  -1.148344 1.941046 2.731071
H  1.945615 0.21399 1.640904
H  -0.898354 3.271469 0.706721
H  0.577509 4.078379 -1.104828
H  2.717494 2.928037 -1.574346
H  1.975481 -0.986918 -1.020628
H  5.793301 -0.09627 0.700757
H  2.464284 -3.389263 -0.859546
H  6.288384 -2.51471 0.845061
H  4.61871 -4.172766 0.072457
totalener: -1117.84422322 hartree
nucrepener: 2336.68447601 hartree
electener: -3454.52869923 hartree
oneelecener: -6162.15913502 hartree
twoeener: 2707.63043579 hartree
kineticenergy: 1112.85967303 hartree
xcener: -110.235299944997 hartree
chargesum: -0.0000000
charge: -0.264879 -0.387215 -0.299417 0.141113 -0.060618 -0.115776 -0.243313 -0.281713 -0.179341 0.355936 -0.001891 -0.211312 -0.217024 0.042768 -0.013611 -0.177421 -0.110359 0.216415 -0.143342 -0.170165 0.168629 -0.071597 -0.167570 -0.181098 -0.116791 -0.113239 0.092575 0.083093 0.089920 0.069862 0.087933 0.084693 0.086768 0.106617 0.082654 0.083311 0.078747 0.084453 0.109640 0.085176 0.040866 0.106593 0.106827 0.118573 0.121539 0.127411 0.124398 0.134624 0.125160 0.122491 0.124450 0.124458
qa: -0.2649 -0.3872 -0.2994 0.1411 -0.0606 -0.1158 -0.2433 -0.2817 -0.1793 0.3559 -0.0019 -0.2113 -0.2170 0.0428 -0.0136 -0.1774 -0.1104 0.2164 -0.1433 -0.1702 0.1686 -0.0716 -0.1676 -0.1811 -0.1168 -0.1132 0.0926 0.0831 0.0899 0.0699 0.0879 0.0847 0.0868 0.1066 0.0827 0.0833 0.0787 0.0845 0.1096 0.0852 0.0409 0.1066 0.1068 0.1186 0.1215 0.1274 0.1244 0.1346 0.1252 0.1225 0.1245 0.1245
va: 2.1210 2.0957 2.1116 3.7313 3.8884 3.8270 3.9039 3.9074 3.9035 4.1686 3.7802 3.9430 3.9175 3.8834 3.6744 3.9349 3.8837 3.8488 3.9335 3.9538 3.8894 3.8601 3.9958 4.0148 3.9587 3.9343 1.0057 1.0313 1.0053 1.0072 1.0046 1.0053 0.9977 1.0197 1.0103 0.9998 1.0117 0.9990 1.0016 1.0034 1.0145 0.9955 1.0112 1.0147 1.0242 1.0010 1.0129 0.9778 1.0139 1.0033 0.9995 1.0006
dispcorr: -0.028865036 hartree
energy: -1117.873088256576
dipole: -20.78169 20.89727 0.11558 -7.14303 6.54611 -0.59692 -8.05803 8.13337 0.07533
magnitude: 0.61266 au
magnitude: 1.55725 debye
