program: Orca
programVersion: 5.0.2
elementType: O O O C C C C C C C C C C C C C C C C C C C C C C C H H H H H H H H H H H H H H H H H H H H H H H H H H
charge: 0
multiplicity: 1
keywords: wb97x-d3
keywords: def2-TZVPP
keywords: def2/J RIJCOSX
keywords: DEFGRID2
keywords: scfconv7
keywords: smallprint printgap noloewdin
keywords: NOSOSCF
formula: C23H26O3
InChI: InChI=1/C23H26O3/c1-16(2)13-20-21(23(20,3)4)22(24)25-15-17-9-8-12-19(14-17)26-18-10-6-5-7-11-18/h5-14,20-21H,15H2,1-4H3
52 atoms
O  -1.32361 1.6613 -0.882271
O  -1.2354 1.119381 1.28757
O  3.758808 0.858505 -0.356391
C  -1.645773 -1.780622 0.212255
C  -3.028053 -1.302374 0.534725
C  -2.107167 -0.435984 -0.321068
C  -1.516839 -2.868291 -0.827764
C  -0.593484 -1.882413 1.288643
C  -3.44981 -0.921707 1.895001
C  -1.525059 0.834378 0.154337
C  -4.596901 -1.2624 2.488864
C  -4.884327 -0.811071 3.891045
C  -5.683335 -2.094572 1.876401
C  -0.697077 2.915631 -0.636062
C  0.76905 2.87856 -0.97216
C  1.582199 1.853528 -0.503488
C  1.329797 3.896972 -1.733969
C  2.933004 1.84346 -0.817237
C  2.687786 3.895025 -2.015147
C  3.497255 2.863527 -1.569608
C  3.359151 -0.442115 -0.460751
C  2.71923 -0.929186 -1.595114
C  3.658108 -1.290854 0.595642
C  2.383403 -2.272249 -1.661908
C  3.321824 -2.633433 0.512052
C  2.680189 -3.130507 -0.612541
H  -3.80549 -1.762993 -0.065145
H  -2.347344 -0.421976 -1.377703
H  -0.542033 -2.819131 -1.316071
H  -2.283749 -2.792014 -1.600011
H  -1.609245 -3.852595 -0.364831
H  -0.675036 -2.854495 1.778265
H  -0.672778 -1.11954 2.056338
H  0.405435 -1.817409 0.852906
H  -2.7598 -0.312539 2.463997
H  -5.800208 -0.215464 3.934161
H  -4.074497 -0.20897 4.301321
H  -5.037754 -1.665268 4.556105
H  -6.63075 -1.549873 1.873002
H  -5.850046 -2.999856 2.465762
H  -5.479226 -2.406048 0.854585
H  -0.844436 3.220728 0.401856
H  -1.2069 3.637993 -1.27459
H  1.180404 1.067217 0.122969
H  0.703981 4.696928 -2.110354
H  3.116868 4.693769 -2.605676
H  4.554316 2.841655 -1.798983
H  2.489294 -0.268974 -2.421375
H  4.154113 -0.895732 1.472295
H  1.891813 -2.6501 -2.549139
H  3.555638 -3.291647 1.338315
H  2.414745 -4.177256 -0.672137
totalener: -1117.84510700 hartree
nucrepener: 2302.70645800 hartree
electener: -3420.55156501 hartree
oneelecener: -6094.14208497 hartree
twoeener: 2673.59051996 hartree
kineticenergy: 1112.84151147 hartree
xcener: -110.233811869313 hartree
chargesum: 0.0000000
charge: -0.266426 -0.398576 -0.300357 0.113128 0.025704 -0.053942 -0.243582 -0.237995 -0.222059 0.313081 -0.056997 -0.205042 -0.242764 0.070840 0.008902 -0.137344 -0.186669 0.193612 -0.083931 -0.202499 0.199431 -0.110378 -0.175176 -0.160041 -0.092085 -0.146026 0.086949 0.080522 0.080491 0.071592 0.088943 0.090220 0.106410 0.045227 0.108660 0.081397 0.081815 0.080751 0.085963 0.086438 0.076141 0.113185 0.094431 0.144581 0.107029 0.124473 0.125970 0.129863 0.125127 0.132896 0.124107 0.124009
qa: -0.2664 -0.3986 -0.3004 0.1131 0.0257 -0.0539 -0.2436 -0.2380 -0.2221 0.3131 -0.0570 -0.2050 -0.2428 0.0708 0.0089 -0.1373 -0.1867 0.1936 -0.0839 -0.2025 0.1994 -0.1104 -0.1752 -0.1600 -0.0921 -0.1460 0.0869 0.0805 0.0805 0.0716 0.0889 0.0902 0.1064 0.0452 0.1087 0.0814 0.0818 0.0808 0.0860 0.0864 0.0761 0.1132 0.0944 0.1446 0.1070 0.1245 0.1260 0.1299 0.1251 0.1329 0.1241 0.1240
va: 2.1318 2.0717 2.1034 3.6951 3.8048 3.8674 3.9044 3.9238 3.9025 4.1937 3.8102 3.9380 3.9459 3.8679 3.7973 3.9251 4.0054 3.8630 3.9490 4.0388 3.8647 3.8871 3.9997 3.9069 3.9072 3.8923 1.0086 1.0310 1.0166 1.0114 1.0035 1.0060 1.0222 1.0158 1.0289 0.9983 1.0126 0.9978 0.9990 0.9990 1.0169 1.0141 0.9982 1.0053 1.0127 0.9996 1.0121 1.0058 1.0133 0.9976 0.9995 1.0022
dispcorr: -0.026808479 hartree
energy: -1117.871915482536
dipole: -24.14979 23.75838 -0.39141 -16.98495 16.64864 -0.33631 9.13190 -9.77638 -0.64448
magnitude: 0.82562 au
magnitude: 2.09857 debye
