program: Orca
programVersion: 5.0.2
elementType: O O O C C C C C C C C C C C C C C C C C C C C C C C H H H H H H H H H H H H H H H H H H H H H H H H H H
charge: 0
multiplicity: 1
keywords: wb97x-d3
keywords: def2-TZVPP
keywords: def2/J RIJCOSX
keywords: DEFGRID2
keywords: scfconv7
keywords: smallprint printgap noloewdin
keywords: NOSOSCF
formula: C23H26O3
InChI: InChI=1/C23H26O3/c1-16(2)13-20-21(23(20,3)4)22(24)25-15-17-9-8-12-19(14-17)26-18-10-6-5-7-11-18/h5-14,20-21H,15H2,1-4H3
52 atoms
O  -2.394697 1.846962 -0.999846
O  -1.945175 -0.280836 -1.520768
O  3.051345 0.302833 -1.233893
C  -4.605526 -0.951708 -0.057467
C  -3.581355 -0.933487 1.024439
C  -3.679229 0.243608 0.056336
C  -6.040226 -0.683421 0.334534
C  -4.481931 -1.928219 -1.201294
C  -2.427707 -1.866434 1.030842
C  -2.590353 0.522444 -0.902045
C  -1.188592 -1.563725 1.415385
C  -0.097617 -2.588108 1.385256
C  -0.773239 -0.195158 1.861138
C  -1.353592 2.290938 -1.866698
C  -0.008914 2.264377 -1.194651
C  0.907432 1.256946 -1.474584
C  0.327016 3.254589 -0.277809
C  2.155588 1.268117 -0.871079
C  1.573653 3.253658 0.328206
C  2.500078 2.267642 0.028701
C  3.563494 -0.553252 -0.307979
C  4.638932 -1.331125 -0.725622
C  3.053517 -0.702646 0.975688
C  5.194115 -2.25749 0.13931
C  3.62534 -1.63368 1.831941
C  4.69366 -2.414878 1.425176
H  -3.962066 -0.684736 2.01302
H  -4.13058 1.139818 0.466285
H  -6.598943 -0.251733 -0.497565
H  -6.113857 0.005719 1.176881
H  -6.538518 -1.610548 0.623405
H  -3.454445 -2.1448 -1.476606
H  -4.989251 -1.543149 -2.08748
H  -4.96723 -2.86813 -0.930049
H  -2.630875 -2.882605 0.706776
H  0.364016 -2.706521 2.368865
H  0.700854 -2.287158 0.703578
H  -0.461576 -3.563404 1.064735
H  -1.61225 0.483507 2.001225
H  -0.102196 0.260002 1.127028
H  -0.223851 -0.243569 2.804714
H  -1.623758 3.316071 -2.121182
H  -1.339823 1.7068 -2.78822
H  0.654905 0.463229 -2.165666
H  -0.383754 4.03841 -0.046721
H  1.834674 4.034726 1.029826
H  3.481846 2.276579 0.484566
H  5.024833 -1.208647 -1.729101
H  2.211962 -0.1144 1.314337
H  6.027243 -2.861031 -0.196083
H  3.217182 -1.747514 2.827711
H  5.130149 -3.139804 2.098333
totalener: -1117.84291679 hartree
nucrepener: 2337.21077351 hartree
electener: -3455.05369030 hartree
oneelecener: -6163.37064557 hartree
twoeener: 2708.31695527 hartree
kineticenergy: 1112.86491048 hartree
xcener: -110.236642135121 hartree
chargesum: -0.0000000
charge: -0.264012 -0.386060 -0.296277 0.126486 -0.039166 -0.125496 -0.243475 -0.282846 -0.189872 0.352506 0.052983 -0.244136 -0.268108 0.040781 -0.031700 -0.119333 -0.157328 0.194544 -0.096936 -0.172578 0.321845 -0.224154 -0.241682 -0.087210 -0.128198 -0.146854 0.095989 0.084847 0.089877 0.070558 0.087240 0.113034 0.084521 0.085868 0.085190 0.079682 0.102251 0.082008 0.099843 0.049129 0.101155 0.109082 0.107239 0.120435 0.111994 0.127515 0.133378 0.122816 0.144507 0.123685 0.121580 0.122856
qa: -0.2640 -0.3861 -0.2963 0.1265 -0.0392 -0.1255 -0.2435 -0.2828 -0.1899 0.3525 0.0530 -0.2441 -0.2681 0.0408 -0.0317 -0.1193 -0.1573 0.1945 -0.0969 -0.1726 0.3218 -0.2242 -0.2417 -0.0872 -0.1282 -0.1469 0.0960 0.0848 0.0899 0.0706 0.0872 0.1130 0.0845 0.0859 0.0852 0.0797 0.1023 0.0820 0.0998 0.0491 0.1012 0.1091 0.1072 0.1204 0.1120 0.1275 0.1334 0.1228 0.1445 0.1237 0.1216 0.1229
va: 2.1174 2.0949 2.1159 3.7269 3.8891 3.8183 3.9044 3.9106 3.8999 4.1581 3.6413 3.9617 3.9478 3.8774 3.6702 3.9385 3.9876 3.8586 3.9240 3.9716 3.7470 4.0315 3.8817 3.9431 3.9702 3.9747 1.0051 1.0316 1.0049 1.0078 1.0048 1.0168 1.0051 0.9982 1.0110 0.9994 0.9903 1.0167 1.0131 1.0164 1.0000 0.9931 1.0125 1.0344 1.0116 0.9994 1.0027 1.0156 0.9922 0.9983 1.0031 1.0007
dispcorr: -0.029367293 hartree
energy: -1117.872284079656
dipole: -17.53691 17.23433 -0.30257 -10.09073 10.59877 0.50804 9.26949 -8.70578 0.56371
magnitude: 0.81696 au
magnitude: 2.07654 debye
