program: Orca
programVersion: 5.0.2
elementType: O O O C C C C C C C C C C C C C C C C C C C C C C C H H H H H H H H H H H H H H H H H H H H H H H H H H
charge: 0
multiplicity: 1
keywords: wb97x-d3
keywords: def2-TZVPP
keywords: def2/J RIJCOSX
keywords: DEFGRID2
keywords: scfconv7
keywords: smallprint printgap noloewdin
keywords: NOSOSCF
formula: C23H26O3
InChI: InChI=1/C23H26O3/c1-16(2)13-20-21(23(20,3)4)22(24)25-15-17-9-8-12-19(14-17)26-18-10-6-5-7-11-18/h5-14,20-21H,15H2,1-4H3
52 atoms
O  -1.992546 1.727888 -1.277628
O  -3.142244 -0.190128 -1.347833
O  3.265117 0.86081 -0.919771
C  -4.7173 0.869306 1.100632
C  -3.455064 0.344475 1.695005
C  -3.396892 1.310733 0.50852
C  -5.452269 1.937571 1.87716
C  -5.646943 -0.055057 0.352234
C  -3.056341 -1.079423 1.571195
C  -2.869767 0.837945 -0.788294
C  -1.801332 -1.519554 1.487412
C  -1.493559 -2.981024 1.378834
C  -0.608165 -0.614963 1.465829
C  -1.294908 1.369571 -2.470373
C  -0.119863 0.480328 -2.172148
C  1.042398 1.038322 -1.651457
C  -0.186188 -0.892581 -2.375983
C  2.134943 0.23729 -1.358253
C  0.910589 -1.688175 -2.077585
C  2.0759 -1.135129 -1.572044
C  4.03358 0.285489 0.049302
C  3.482381 -0.347016 1.157419
C  5.41014 0.403012 -0.080389
C  4.322877 -0.866786 2.129514
C  6.237803 -0.112465 0.904788
C  5.700362 -0.755003 2.010116
H  -3.149189 0.817545 2.625311
H  -3.088756 2.3201 0.756435
H  -4.769346 2.592359 2.420339
H  -6.124904 1.4850 2.608281
H  -6.052895 2.561665 1.213403
H  -5.132168 -0.840193 -0.192123
H  -6.245071 0.506574 -0.367033
H  -6.337604 -0.52253 1.05734
H  -3.859704 -1.809635 1.565844
H  -0.9588 -3.191232 0.449234
H  -2.394887 -3.592493 1.394204
H  -0.846396 -3.312335 2.194954
H  0.052753 -0.83022 2.310662
H  -0.867658 0.440856 1.506807
H  -0.023811 -0.778232 0.556737
H  -0.958172 2.317131 -2.89092
H  -1.968402 0.899321 -3.188298
H  1.110937 2.105831 -1.478807
H  -1.094975 -1.33785 -2.756309
H  0.861807 -2.756082 -2.245166
H  2.929611 -1.76381 -1.354341
H  2.408391 -0.42863 1.266591
H  5.822103 0.901566 -0.948036
H  3.892333 -1.358251 2.992207
H  7.31052 -0.016349 0.801077
H  6.348673 -1.161526 2.774304
totalener: -1117.84416122 hartree
nucrepener: 2306.12254924 hartree
electener: -3423.96671046 hartree
oneelecener: -6101.06809438 hartree
twoeener: 2677.10138392 hartree
kineticenergy: 1112.85835423 hartree
xcener: -110.234830890652 hartree
chargesum: -0.0000000
charge: -0.264386 -0.385821 -0.298880 0.138159 -0.046394 -0.121297 -0.244176 -0.282870 -0.185416 0.351152 -0.000883 -0.211421 -0.209883 0.042187 -0.008907 -0.206304 -0.114289 0.210614 -0.142977 -0.134476 0.177838 -0.080661 -0.175227 -0.168163 -0.114497 -0.118128 0.095899 0.084599 0.070593 0.087656 0.089666 0.108875 0.084997 0.085826 0.083495 0.084513 0.078871 0.082425 0.098239 0.093790 0.034283 0.106723 0.107884 0.109850 0.122032 0.127490 0.130988 0.129127 0.124723 0.122452 0.124852 0.125258
qa: -0.2644 -0.3858 -0.2989 0.1382 -0.0464 -0.1213 -0.2442 -0.2829 -0.1854 0.3512 -0.0009 -0.2114 -0.2099 0.0422 -0.0089 -0.2063 -0.1143 0.2106 -0.1430 -0.1345 0.1778 -0.0807 -0.1752 -0.1682 -0.1145 -0.1181 0.0959 0.0846 0.0706 0.0877 0.0897 0.1089 0.0850 0.0858 0.0835 0.0845 0.0789 0.0824 0.0982 0.0938 0.0343 0.1067 0.1079 0.1099 0.1220 0.1275 0.1310 0.1291 0.1247 0.1225 0.1249 0.1253
va: 2.1178 2.0971 2.1079 3.7263 3.8870 3.8272 3.9043 3.9076 3.9104 4.1686 3.7341 3.9409 3.9297 3.8732 3.6757 4.0270 3.8924 3.8690 3.9311 3.8931 3.8683 3.8674 4.0001 4.0052 3.9564 3.9364 1.0053 1.0315 1.0074 1.0045 1.0051 1.0185 1.0056 0.9978 1.0096 1.0000 1.0117 0.9988 1.0017 1.0122 1.0162 0.9952 1.0108 1.0253 1.0255 1.0026 1.0045 0.9919 1.0139 1.0028 0.9993 1.0003
dispcorr: -0.028483438 hartree
energy: -1117.872644657639
dipole: -19.06991 19.30406 0.23415 -6.04330 6.08487 0.04157 12.61727 -12.23051 0.38676
magnitude: 0.45403 au
magnitude: 1.15404 debye
