program: Orca
programVersion: 5.0.2
elementType: O O O C C C C C C C C C C C C C C C C C C C C C C C H H H H H H H H H H H H H H H H H H H H H H H H H H
charge: 0
multiplicity: 1
keywords: wb97x-d3
keywords: def2-TZVPP
keywords: def2/J RIJCOSX
keywords: DEFGRID2
keywords: scfconv7
keywords: smallprint printgap noloewdin
keywords: NOSOSCF
formula: C23H26O3
InChI: InChI=1/C23H26O3/c1-16(2)13-20-21(23(20,3)4)22(24)25-15-17-9-8-12-19(14-17)26-18-10-6-5-7-11-18/h5-14,20-21H,15H2,1-4H3
52 atoms
O  -1.342572 1.233781 -0.97726
O  -1.416949 0.981414 1.244605
O  3.701013 0.687296 -1.356237
C  -1.687519 -2.05583 0.64415
C  -3.086812 -1.546029 0.600272
C  -1.998276 -0.841993 -0.207985
C  -1.378648 -3.312708 -0.13608
C  -0.868869 -1.931517 1.905085
C  -3.745316 -0.912416 1.76941
C  -1.559937 0.522217 0.145436
C  -4.691273 0.023728 1.699616
C  -5.335268 0.57859 2.932965
C  -5.174064 0.6123 0.409445
C  -0.816919 2.540019 -0.81662
C  0.657515 2.53781 -0.514748
C  1.48757 1.566597 -1.058299
C  1.206322 3.550299 0.262555
C  2.85255 1.607334 -0.809618
C  2.573277 3.595972 0.483723
C  3.405579 2.621086 -0.042969
C  3.416585 -0.641223 -1.249378
C  2.812929 -1.190467 -0.123919
C  3.806514 -1.455752 -2.304258
C  2.609293 -2.560866 -0.065076
C  3.596101 -2.823206 -2.229912
C  2.994705 -3.383992 -1.112812
H  -3.761081 -2.116171 -0.034757
H  -2.023825 -1.023194 -1.276253
H  -1.982547 -3.390209 -1.041052
H  -1.577056 -4.199172 0.469219
H  -0.32939 -3.336664 -0.435927
H  -1.029415 -2.810574 2.532567
H  -1.100978 -1.047863 2.491543
H  0.193935 -1.891149 1.660894
H  -3.445187 -1.268025 2.749925
H  -4.953111 0.112074 3.839815
H  -6.418554 0.43575 2.911044
H  -5.162633 1.654731 3.011841
H  -6.251482 0.470229 0.294306
H  -4.685133 0.186675 -0.464446
H  -5.000777 1.691357 0.394103
H  -1.359972 3.092342 -0.046253
H  -1.000145 3.033771 -1.772931
H  1.077509 0.774763 -1.673195
H  0.562451 4.301343 0.703038
H  2.994912 4.386836 1.089733
H  4.472299 2.638575 0.136285
H  2.511586 -0.560291 0.703195
H  4.27572 -1.012566 -3.172764
H  2.151781 -2.988499 0.817707
H  3.903564 -3.45291 -3.054443
H  2.832839 -4.451797 -1.056254
totalener: -1117.84311908 hartree
nucrepener: 2320.67757696 hartree
electener: -3438.52069604 hartree
oneelecener: -6130.19965578 hartree
twoeener: 2691.67895974 hartree
kineticenergy: 1112.86205749 hartree
xcener: -110.234808222412 hartree
chargesum: 0.0000000
charge: -0.285288 -0.365045 -0.301941 0.150632 -0.063577 -0.071937 -0.239822 -0.278955 -0.187317 0.308797 0.001916 -0.209475 -0.258380 0.071664 0.071409 -0.206265 -0.181180 0.214300 -0.088600 -0.207136 0.235949 -0.129331 -0.209685 -0.171813 -0.088623 -0.144155 0.096981 0.085517 0.070973 0.087137 0.086079 0.091432 0.111456 0.058693 0.082981 0.077567 0.082382 0.087184 0.095619 0.085008 0.089619 0.099239 0.105720 0.129947 0.105326 0.124464 0.125508 0.136393 0.123846 0.143917 0.124532 0.126339
qa: -0.2853 -0.3650 -0.3019 0.1506 -0.0636 -0.0719 -0.2398 -0.2790 -0.1873 0.3088 0.0019 -0.2095 -0.2584 0.0717 0.0714 -0.2063 -0.1812 0.2143 -0.0886 -0.2071 0.2359 -0.1293 -0.2097 -0.1718 -0.0886 -0.1442 0.0970 0.0855 0.0710 0.0871 0.0861 0.0914 0.1115 0.0587 0.0830 0.0776 0.0824 0.0872 0.0956 0.0850 0.0896 0.0992 0.1057 0.1299 0.1053 0.1245 0.1255 0.1364 0.1238 0.1439 0.1245 0.1263
va: 2.0973 2.1163 2.1039 3.7062 3.9277 3.7866 3.9035 3.9093 3.9045 4.1575 3.7486 3.9412 3.9497 3.8730 3.6663 3.9557 4.0317 3.8371 3.9419 4.0532 3.8437 3.8782 4.0320 3.9264 3.9437 3.9488 1.0042 1.0304 1.0098 1.0038 1.0119 0.9982 1.0220 1.0232 1.0120 1.0113 0.9981 0.9991 1.0011 1.0085 0.9999 1.0140 0.9860 1.0217 1.0119 0.9995 1.0118 1.0053 1.0143 0.9870 0.9982 1.0010
dispcorr: -0.027260509 hartree
energy: -1117.870379588590
dipole: -23.72570 23.27066 -0.45504 -10.11397 9.92818 -0.18579 9.53239 -9.84669 -0.31430
magnitude: 0.58341 au
magnitude: 1.48291 debye
