program: Gaussian 09
title: 000074974
version: EM64L-G09RevD.01
frameworkgroup: C1[X(C12H8O4)]
method: RPBEPBE
basis: SDD
operation: Freq
keyword: #pfreq=noraman
keyword: PBEPBE/SDD
title: #p freq=noraman PBEPBE/SDD
converged: NO YES NO NO
title: Mulliken charges:
elementType: O O O O C C C C C C C C C C C C H H H H H H H H
charge: -0.395728 -0.438949 -0.208141 -0.249085 0.204888 0.410127 0.297774 -0.559726 -0.345838 -0.430021 0.263392 -0.350323 -0.379565 -0.234096 -0.001037 0.104284 0.280410 0.244791 0.251025 0.277773 0.249175 0.238608 0.383545 0.386718
chargesum: 0.00000
title: Mulliken charges with hydrogens summed into heavy atoms:
elementType: O O O O C C C C C C C C C C C C
charge: -0.012183 -0.052231 -0.208141 -0.249085 0.204888 0.410127 0.297774 -0.279316 -0.101047 -0.178995 0.263392 -0.072551 -0.130391 0.004512 -0.001037 0.104284
polarizability: 2.19590178e+02 1.52423528e+01 1.60515021e+02 -1.17079522e+00 1.28686374e+00 6.72758447e+01
1716.lowfreq: -74.1375 -8.2537 -0.0004 0.0005 0.0007 2.9128 6.8542 55.2138 67.1548
frequency: -74.1368 55.2100 67.1545 106.1057 111.8700 174.0311 184.2081 236.0571 306.5709 327.5404 342.5306 369.5756 444.9287 474.1913 509.9648 524.2577 545.9410 568.9446 597.0982 621.3379 623.6697 659.6059 673.2588 697.8435 722.7656 733.1575 777.8146 816.1214 818.0389 850.6182 887.5387 918.5390 957.3921 970.8646 987.6756 990.8807 1035.7273 1056.7300 1079.6198 1133.9537 1166.1094 1174.6880 1220.8955 1232.9430 1266.3172 1303.1855 1324.2565 1357.4663 1391.2110 1419.3839 1441.9940 1460.4980 1513.3934 1584.7967 1599.3177 1631.2607 1645.0270 1650.7011 3134.7214 3140.7749 3146.0477 3146.9696 3168.0224 3182.7799 3484.6836 3529.7634
redmass: 9.8047 11.1030 6.0104 7.7225 5.3038 7.0553 4.6692 4.6574 7.5415 6.0561 4.8513 6.6455 3.2629 3.1427 5.7356 6.6286 4.9688 2.0708 3.8273 1.6399 1.6472 3.4946 3.7819 5.9661 2.9133 5.0725 1.9387 5.6343 1.7462 2.0719 5.5598 1.3941 1.5600 5.9620 1.3886 1.4003 3.3988 2.5324 2.2087 1.6014 1.3004 1.3369 1.5666 1.8185 1.6480 2.2268 2.7245 2.5168 3.5484 4.8650 3.8111 2.9072 4.2736 7.6728 5.7248 7.2278 8.2043 9.3237 1.0870 1.0900 1.0923 1.0920 1.0994 1.0954 1.0636 1.0641
irintensity: 1.6661 1.2305 0.9432 0.1988 0.4685 0.9792 3.9763 0.1950 3.7382 4.7123 1.0827 2.5203 5.6886 16.8322 7.1765 6.9516 75.5215 21.1859 62.7717 85.4595 57.9873 6.6257 56.3254 4.9705 19.5722 35.5682 54.4472 2.2460 43.7721 8.9864 32.7800 14.6304 9.0118 102.0203 1.8085 4.6704 228.8908 192.4974 64.3843 166.5605 3.8220 23.0190 1.8218 9.7828 17.5411 57.9850 98.6560 11.7373 6.7511 0.6525 4.4161 17.0904 18.8859 14.8454 19.0347 198.1245 124.4109 228.5189 0.3286 6.0785 4.8031 4.7706 20.1055 2.4842 22.9310 54.5823
temp: 298.150 k
press: 1.00000 atm
elementType: 8 8 8 8 6 6 6 6 6 6 6 6 6 6 6 6 1 1 1 1 1 1 1 1
symmnumber: 1
zpe: 450253.7 jmol-1
zpe.correction: 0.171493 hartree
zpe.thermalcorrener: 0.183755 hartree
zpe.thermalcorrenthalpy: 0.184699 hartree
zpe.thermalcorrgfe: 0.132265 hartree
zpe.sumelectzpe: -761.893175 hartree
zpe.sumelectthermal: -761.880913 hartree
zpe.sumelectthermalent: -761.879969 hartree
zpe.sumelectthermalfe: -761.932402 hartree
dipole: 1.2335 -0.1930 1.2879
dipole: 1.7937
quadrupole: -84.9407 -78.6737 -99.1608
quadrupole: 9.5046 6.2534 -4.2854
quadrupole: 2.6510 8.9181 -11.5691 9.5046 6.2534 -4.2854
hfenergy: -762.0646676 hartree
pointgroup: C01 [X(C12H8O4)]
dipole: 0.4804041 0.0759992 -0.5113313 debye
dipolederiv: -0.5035766 -0.0777966 0.2605202 -0.1545712 -0.4243136 0.3539107 0.3148689 0.2956344 -1.0170877 -0.721908 0.4830336 0.0004771 0.6433061 -1.075406 -0.0003733 0.0003307 0.0001019 -0.4240286 -0.5589596 -0.2393839 -0.1722925 -0.3550393 -0.5881733 -0.2463472 -0.0172563 0.0038081 -0.8404325 -1.1602293 -0.1910545 -0.00255 -0.2750254 -0.7209735 -0.0016257 -0.003668 -0.0019202 -0.3294867 0.2287165 -0.1480758 -0.0079305 -0.1545513 -0.0380922 0.0012026 -0.0022339 0.0005175 0.0328517 -0.1648334 -0.1366945 0.000431 -0.0546081 -0.0484518 -0.0010835 0.0093903 0.0047519 0.052851 -0.0986512 0.0370517 0.0144076 -0.0182829 -0.140479 0.0165929 -0.0025763 -0.0038095 -0.1057103 0.2406597 0.0204103 0.0005458 -0.1898905 0.0483829 -0.0009044 -0.0012636 -0.0013317 -0.1189666 -0.1806069 0.1916481 -0.0011297 0.137544 0.0416991 -0.0027882 0.0008336 0.0019847 -0.1383909 0.0387967 0.1225299 0.0003143 -0.0628712 0.0716522 0.0006281 -0.0025728 -0.0018416 -0.153032 -0.8019271 0.239853 -0.0009815 0.2151775 -0.0830106 0.0008316 -0.0014043 -0.0001819 0.0064806 0.0844675 -0.1344233 -0.0009955 0.1369536 0.0266772 0.0023786 -0.0002359 0.0023054 -0.12326 0.0462191 -0.0077668 0.0000096 0.0236033 0.0424533 -0.0099382 0.0020135 0.00747 -0.1159482 -0.1211436 -0.1045378 0.0009892 -0.0833161 0.0930693 0.0008191 0.0085442 0.0073976 -0.1475391 0.7725764 0.5649354 -0.0503729 0.8160934 0.8920656 -0.0543152 -0.2117918 -0.2121762 1.5793274 2.2396563 -0.329982 0.0041219 -0.2677447 1.4048977 0.0026141 0.005275 0.0027173 0.2314608 0.0864383 -0.0374477 -0.0003051 -0.057333 0.0145334 -0.0003745 -0.0003693 0.0002521 0.1517445 0.0210447 -0.0929618 0.0007 -0.0670422 -0.02526 -0.0002484 0.0001314 -0.002057 0.140219 0.0277091 -0.1111893 -0.0006446 -0.0433224 -0.0253469 -0.0004033 -0.0012511 -0.0010655 0.1550234 0.1045411 0.051596 -0.0000194 0.0430588 0.010419 -0.0005142 0.000123 -0.0008837 0.1600404 -0.082065 0.0118345 -0.0004039 -0.0030018 0.0999391 -0.0007938 -0.0042279 -0.0039368 0.1496754 0.0376975 0.0788039 -0.0000913 0.0754415 -0.0761667 -0.0003089 -0.0016807 -0.0021013 0.1624828 0.2837021 -0.1071109 -0.0440802 -0.1308651 0.1825651 -0.0583938 -0.090042 -0.095054 0.2910805 0.1816756 -0.0832714 -0.0007198 -0.1737129 0.3173197 -0.000565 -0.000937 -0.0005814 0.400645 unknown
polarizability: 220.0299674|-14.3644986|160.1051117|0.2257253|0.1358049|67.2459638 unknown
InChI: InChI=1S/C12H8O4/c13-11(14)8-4-5-9-7(6-8)2-1-3-10(9)12(15)16/h1-6,13,15H
charge 0 multiplicity 1
24 atoms
O  3.288164 1.626656 -1.230698
O  -4.170348 1.543944 0.001105
O  3.372376 1.759794 1.084337
O  -4.424938 -0.763883 -0.006466
C  0.67249 0.062218 0.008667
C  -0.120604 -1.152129 0.005041
C  2.106023 -0.056811 0.010655
C  -1.54542 -1.050968 0.001131
C  -0.002658 1.329544 0.013108
C  0.536428 -2.427072 0.004512
C  -2.176961 0.199531 0.003209
C  -1.392566 1.401686 0.010039
C  2.71709 -1.315389 0.010597
C  1.928696 -2.507155 0.008442
C  2.965248 1.176399 0.056049
C  -3.6637 0.234371 -0.000855
H  -2.161686 -1.957268 -0.00253
H  0.58748 2.252306 0.021948
H  -0.07453 -3.336905 0.002176
H  -1.908749 2.364915 0.014089
H  3.809484 -1.391862 0.013091
H  2.429092 -3.480572 0.008731
H  3.867365 2.436328 -1.161366
H  -5.164175 1.50132 -0.001112
