program: Orca
programVersion: 5.0.2
elementType: O O O C C C C C C C C C C C C C C C C C C C C C C C H H H H H H H H H H H H H H H H H H H H H H H H H H
charge: 0
multiplicity: 1
keywords: wb97x-d3
keywords: def2-TZVPP
keywords: def2/J RIJCOSX
keywords: DEFGRID2
keywords: scfconv7
keywords: smallprint printgap noloewdin
keywords: NOSOSCF
formula: C23H26O3
InChI: InChI=1/C23H26O3/c1-16(2)13-20-21(23(20,3)4)22(24)25-15-17-9-8-12-19(14-17)26-18-10-6-5-7-11-18/h5-14,20-21H,15H2,1-4H3
52 atoms
O  -2.351421 1.812455 -1.459565
O  -1.599336 -0.2905 -1.497136
O  3.347723 0.654547 -1.218883
C  -4.266425 -1.11272 -0.184629
C  -3.455418 -0.59554 0.954836
C  -3.618274 0.246312 -0.319019
C  -5.768276 -1.078812 -0.011427
C  -3.805713 -2.297961 -0.998484
C  -2.148066 -1.166367 1.349873
C  -2.425424 0.508434 -1.147252
C  -1.324545 -0.626408 2.25013
C  -0.040395 -1.296692 2.631954
C  -1.581836 0.678789 2.938691
C  -1.174283 2.229479 -2.145002
C  0.039373 2.173995 -1.258801
C  1.148399 1.427906 -1.633439
C  0.048305 2.847989 -0.042855
C  2.256963 1.369135 -0.806248
C  1.158143 2.774798 0.784765
C  2.2686 2.034232 0.411626
C  3.714025 -0.438578 -0.489872
C  5.063796 -0.764997 -0.475213
C  2.791596 -1.225572 0.188646
C  5.490027 -1.880087 0.227566
C  3.23619 -2.334223 0.893337
C  4.581825 -2.666718 0.921497
H  -4.037097 -0.200001 1.782155
H  -4.282357 1.09803 -0.226157
H  -6.272579 -1.021733 -0.977609
H  -6.094286 -0.224295 0.583536
H  -6.115767 -1.982382 0.492754
H  -4.136446 -3.219529 -0.515482
H  -2.730337 -2.348917 -1.13168
H  -4.255038 -2.269703 -1.992386
H  -1.855077 -2.100765 0.885097
H  0.815657 -0.646653 2.433774
H  0.11014 -2.228908 2.087658
H  -0.017496 -1.525722 3.700522
H  -0.766764 1.376754 2.731734
H  -1.61908 0.551661 4.023666
H  -2.506422 1.157199 2.622595
H  -1.383737 3.255792 -2.448665
H  -1.01866 1.636459 -3.048897
H  1.147225 0.870462 -2.561572
H  -0.814245 3.426433 0.263563
H  1.163358 3.304747 1.72832
H  3.137856 1.976622 1.054072
H  5.767956 -0.144625 -1.01391
H  1.735433 -0.98779 0.160019
H  6.542874 -2.129655 0.238117
H  2.515689 -2.944125 1.42269
H  4.919435 -3.531851 1.475597
totalener: -1117.84266653 hartree
nucrepener: 2337.55998257 hartree
electener: -3455.40264910 hartree
oneelecener: -6164.06850542 hartree
twoeener: 2708.66585633 hartree
kineticenergy: 1112.86936575 hartree
xcener: -110.234877961731 hartree
chargesum: -0.0000000
charge: -0.273981 -0.387466 -0.304169 0.139164 -0.063097 -0.083117 -0.239904 -0.278616 -0.145353 0.349275 -0.015867 -0.251435 -0.255079 0.061566 0.032271 -0.139874 -0.198679 0.184838 -0.135185 -0.142143 0.197292 -0.183970 -0.129917 -0.105145 -0.136151 -0.142672 0.087255 0.078506 0.090160 0.069950 0.089098 0.089785 0.101402 0.086399 0.087811 0.083514 0.082992 0.097765 0.079354 0.097890 0.079893 0.111371 0.100011 0.108220 0.117720 0.132124 0.130132 0.122818 0.159189 0.122416 0.118369 0.123274
qa: -0.2740 -0.3875 -0.3042 0.1392 -0.0631 -0.0831 -0.2399 -0.2786 -0.1454 0.3493 -0.0159 -0.2514 -0.2551 0.0616 0.0323 -0.1399 -0.1987 0.1848 -0.1352 -0.1421 0.1973 -0.1840 -0.1299 -0.1051 -0.1362 -0.1427 0.0873 0.0785 0.0902 0.0699 0.0891 0.0898 0.1014 0.0864 0.0878 0.0835 0.0830 0.0978 0.0794 0.0979 0.0799 0.1114 0.1000 0.1082 0.1177 0.1321 0.1301 0.1228 0.1592 0.1224 0.1184 0.1233
va: 2.1187 2.0964 2.0936 3.7689 3.8589 3.8523 3.8967 3.9097 3.8794 4.1580 3.7267 3.9536 3.9473 3.8650 3.6461 4.0289 3.9386 3.9090 3.8835 3.9666 3.8691 4.0080 3.8724 3.9586 3.9618 3.9779 1.0045 1.0317 1.0053 1.0072 1.0045 0.9983 1.0244 1.0038 1.0134 0.9925 1.0039 1.0024 1.0071 1.0024 1.0098 0.9894 1.0099 1.0251 1.0171 0.9977 1.0046 1.0141 0.9821 0.9988 1.0063 1.0009
dispcorr: -0.028449268 hartree
energy: -1117.871115800238
dipole: -18.57014 17.96149 -0.60865 -9.07922 9.44068 0.36146 13.16279 -12.55704 0.60575
magnitude: 0.93168 au
magnitude: 2.36815 debye
