program: Orca
programVersion: 5.0.2
elementType: O O O C C C C C C C C C C C C C C C C C C C C C C C H H H H H H H H H H H H H H H H H H H H H H H H H H
charge: 0
multiplicity: 1
keywords: wb97x-d3
keywords: def2-TZVPP
keywords: def2/J RIJCOSX
keywords: DEFGRID2
keywords: scfconv7
keywords: smallprint printgap noloewdin
keywords: NOSOSCF
formula: C23H26O3
InChI: InChI=1/C23H26O3/c1-16(2)13-20-21(23(20,3)4)22(24)25-15-17-9-8-12-19(14-17)26-18-10-6-5-7-11-18/h5-14,20-21H,15H2,1-4H3
52 atoms
O  -1.522701 2.323199 0.240232
O  -0.518023 0.510038 1.073774
O  3.537236 0.803074 -1.731743
C  -2.837366 -1.014027 -0.346399
C  -3.349128 -0.788247 1.043658
C  -2.771166 0.379144 0.251782
C  -3.860692 -1.19187 -1.443403
C  -1.591117 -1.834495 -0.568617
C  -2.696066 -1.34849 2.243423
C  -1.48601 1.03022 0.580759
C  -3.292303 -2.096812 3.175612
C  -2.517706 -2.597607 4.359107
C  -4.731891 -2.514869 3.159421
C  -0.305664 3.066895 0.347309
C  0.590593 2.78686 -0.825882
C  1.674989 1.930197 -0.694002
C  0.303532 3.351158 -2.065041
C  2.449558 1.619008 -1.804897
C  1.094225 3.053239 -3.162018
C  2.162534 2.178427 -3.041248
C  3.514195 -0.336724 -0.98226
C  4.732865 -0.763442 -0.471237
C  2.362738 -1.084812 -0.768703
C  4.797868 -1.941057 0.255268
C  2.442238 -2.254658 -0.028622
C  3.653564 -2.690653 0.485836
H  -4.429701 -0.722765 1.112556
H  -3.509428 1.073497 -0.131759
H  -4.761989 -0.604942 -1.261704
H  -4.15867 -2.23879 -1.525326
H  -3.454669 -0.884852 -2.409059
H  -1.103047 -1.543935 -1.50126
H  -1.865611 -2.887257 -0.654869
H  -0.862661 -1.747468 0.231904
H  -1.644076 -1.130428 2.375088
H  -2.523346 -3.689907 4.401608
H  -2.960775 -2.248074 5.295314
H  -1.479813 -2.268164 4.338006
H  -5.280212 -2.171051 2.285619
H  -5.25294 -2.146811 4.046548
H  -4.812113 -3.60413 3.184332
H  0.197408 2.85777 1.292572
H  -0.620209 4.110231 0.353022
H  1.896041 1.48947 0.26949
H  -0.539709 4.022313 -2.171198
H  0.874279 3.495583 -4.12454
H  2.778613 1.930014 -3.895324
H  5.620856 -0.171461 -0.650103
H  1.407685 -0.762937 -1.161566
H  5.75059 -2.268544 0.650097
H  1.541017 -2.828762 0.142716
H  3.705262 -3.604556 1.061785
totalener: -1117.84497384 hartree
nucrepener: 2287.76684269 hartree
electener: -3405.61181653 hartree
oneelecener: -6064.42835567 hartree
twoeener: 2658.81653914 hartree
kineticenergy: 1112.85339014 hartree
xcener: -110.233873776311 hartree
chargesum: 0.0000000
charge: -0.265693 -0.412694 -0.299565 0.129128 0.014303 -0.105984 -0.242496 -0.288189 -0.228547 0.378850 -0.035713 -0.208913 -0.244020 0.052166 -0.005611 -0.162759 -0.194764 0.250016 -0.083072 -0.217944 0.271245 -0.225330 -0.166125 -0.086061 -0.099791 -0.156163 0.087472 0.082197 0.070863 0.088008 0.090831 0.092766 0.094853 0.088709 0.116547 0.081251 0.082142 0.082204 0.077063 0.088071 0.085152 0.107143 0.110062 0.133478 0.110158 0.124993 0.124936 0.121739 0.128419 0.121815 0.120855 0.121997
qa: -0.2657 -0.4127 -0.2996 0.1291 0.0143 -0.1060 -0.2425 -0.2882 -0.2285 0.3788 -0.0357 -0.2089 -0.2440 0.0522 -0.0056 -0.1628 -0.1948 0.2500 -0.0831 -0.2179 0.2712 -0.2253 -0.1661 -0.0861 -0.0998 -0.1562 0.0875 0.0822 0.0709 0.0880 0.0908 0.0928 0.0949 0.0887 0.1165 0.0813 0.0821 0.0822 0.0771 0.0881 0.0852 0.1071 0.1101 0.1335 0.1102 0.1250 0.1249 0.1217 0.1284 0.1218 0.1209 0.1220
va: 2.1365 2.0612 2.1184 3.6985 3.8064 3.9157 3.9111 3.9395 3.8937 4.1313 3.7855 3.9408 3.9480 3.8638 3.6664 3.9026 4.0265 3.8328 3.9269 4.0580 3.8416 4.0342 3.9426 3.9360 3.9482 3.9933 1.0105 1.0305 1.0085 1.0041 1.0044 0.9976 1.0063 1.0108 1.0267 0.9984 0.9979 1.0122 1.0149 0.9986 0.9999 1.0120 0.9931 1.0216 1.0127 0.9990 1.0132 1.0157 0.9973 0.9990 1.0016 1.0017
dispcorr: -0.025670980 hartree
energy: -1117.870644820728
dipole: -24.05204 23.18585 -0.86619 -17.53372 17.55954 0.02582 10.73878 -10.84732 -0.10854
magnitude: 0.87335 au
magnitude: 2.21987 debye
