program: Orca
programVersion: 5.0.2
elementType: O O O C C C C C C C C C C C C C C C C C C C C C C C H H H H H H H H H H H H H H H H H H H H H H H H H H
charge: 0
multiplicity: 1
keywords: wb97x-d3
keywords: def2-TZVPP
keywords: def2/J RIJCOSX
keywords: DEFGRID2
keywords: scfconv7
keywords: smallprint printgap noloewdin
keywords: NOSOSCF
formula: C23H26O3
InChI: InChI=1/C23H26O3/c1-16(2)13-20-21(23(20,3)4)22(24)25-15-17-9-8-12-19(14-17)26-18-10-6-5-7-11-18/h5-14,20-21H,15H2,1-4H3
52 atoms
O  -1.774245 1.711155 -0.680169
O  -1.067461 0.720524 1.19939
O  2.931483 0.582308 -2.102927
C  -1.933771 -1.883973 -0.352368
C  -3.034002 -1.530539 0.587363
C  -2.474042 -0.463403 -0.347744
C  -2.294212 -2.699145 -1.572934
C  -0.547038 -2.177076 0.161569
C  -2.847078 -1.485869 2.058746
C  -1.695618 0.674102 0.178185
C  -3.602206 -0.784558 2.902992
C  -3.365796 -0.829709 4.381659
C  -4.710385 0.120808 2.460472
C  -1.052096 2.880728 -0.352406
C  0.426155 2.786951 -0.628835
C  0.997361 1.694682 -1.260744
C  1.237448 3.855252 -0.255237
C  2.367118 1.665476 -1.4863
C  2.596519 3.829819 -0.512663
C  3.176525 2.726597 -1.123255
C  2.951447 -0.607822 -1.438484
C  3.112993 -1.749792 -2.214949
C  2.852758 -0.709667 -0.055793
C  3.189853 -2.990183 -1.603982
C  2.930716 -1.960613 0.539559
C  3.099713 -3.104625 -0.223645
H  -4.021462 -1.863175 0.276307
H  -3.096335 -0.207029 -1.197444
H  -1.592479 -2.513426 -2.38783
H  -3.296751 -2.471086 -1.937312
H  -2.261214 -3.765686 -1.343007
H  0.197532 -1.987426 -0.612925
H  -0.468856 -3.231725 0.431822
H  -0.26935 -1.587073 1.030166
H  -2.046247 -2.092648 2.467937
H  -4.260702 -1.157738 4.916558
H  -3.116594 0.162237 4.76632
H  -2.551418 -1.503306 4.644821
H  -4.514972 1.146298 2.784319
H  -5.661626 -0.171216 2.912575
H  -4.843219 0.136277 1.380447
H  -1.210293 3.155966 0.693854
H  -1.49077 3.665304 -0.971451
H  0.397499 0.853559 -1.583911
H  0.801951 4.714807 0.240778
H  3.215741 4.668049 -0.222261
H  4.240479 2.684688 -1.314363
H  3.184234 -1.65492 -3.290563
H  2.713213 0.16963 0.558583
H  3.317705 -3.874354 -2.214552
H  2.852464 -2.033991 1.616282
H  3.158351 -4.074866 0.250447
totalener: -1117.84236683 hartree
nucrepener: 2341.42930559 hartree
electener: -3459.27167242 hartree
oneelecener: -6171.87862038 hartree
twoeener: 2712.60694796 hartree
kineticenergy: 1112.85901794 hartree
xcener: -110.235887885247 hartree
chargesum: -0.0000000
charge: -0.281949 -0.355306 -0.301368 0.168819 -0.055725 -0.092779 -0.240361 -0.289786 -0.172354 0.290410 -0.001068 -0.211858 -0.259883 0.044067 0.056672 -0.153013 -0.185090 0.189465 -0.104138 -0.171385 0.241500 -0.201762 -0.136797 -0.088766 -0.152423 -0.149738 0.096927 0.084843 0.091772 0.071903 0.087843 0.064068 0.094582 0.103889 0.083813 0.082107 0.086523 0.076731 0.089360 0.094410 0.081087 0.107760 0.117580 0.118239 0.108060 0.125087 0.125684 0.122225 0.128970 0.122743 0.126558 0.121852
qa: -0.2819 -0.3553 -0.3014 0.1688 -0.0557 -0.0928 -0.2404 -0.2898 -0.1724 0.2904 -0.0011 -0.2119 -0.2599 0.0441 0.0567 -0.1530 -0.1851 0.1895 -0.1041 -0.1714 0.2415 -0.2018 -0.1368 -0.0888 -0.1524 -0.1497 0.0969 0.0848 0.0918 0.0719 0.0878 0.0641 0.0946 0.1039 0.0838 0.0821 0.0865 0.0767 0.0894 0.0944 0.0811 0.1078 0.1176 0.1182 0.1081 0.1251 0.1257 0.1222 0.1290 0.1227 0.1266 0.1219
va: 2.1111 2.1203 2.1001 3.7422 3.9234 3.8089 3.8983 3.9062 3.8978 4.1711 3.7520 3.9431 3.9488 3.8871 3.6737 4.0076 4.0095 3.8697 3.9361 4.0255 3.7920 4.0099 3.8473 3.9352 3.9205 3.9257 1.0026 1.0307 1.0048 1.0077 1.0047 1.0097 1.0021 1.0122 1.0109 0.9980 0.9992 1.0115 0.9995 1.0011 1.0082 1.0095 0.9861 1.0145 1.0085 0.9999 1.0100 1.0157 1.0116 0.9988 1.0015 1.0016
dispcorr: -0.028093495 hartree
energy: -1117.870460322206
dipole: -19.15517 18.62730 -0.52787 -12.15838 12.26400 0.10562 12.20040 -12.21208 -0.01168
magnitude: 0.53846 au
magnitude: 1.36867 debye
