program: Orca
programVersion: 5.0.2
elementType: O O O C C C C C C C C C C C C C C C C C C C C C C C H H H H H H H H H H H H H H H H H H H H H H H H H H
charge: 0
multiplicity: 1
keywords: wb97x-d3
keywords: def2-TZVPP
keywords: def2/J RIJCOSX
keywords: DEFGRID2
keywords: scfconv7
keywords: smallprint printgap noloewdin
keywords: NOSOSCF
formula: C23H26O3
InChI: InChI=1/C23H26O3/c1-16(2)13-20-21(23(20,3)4)22(24)25-15-17-9-8-12-19(14-17)26-18-10-6-5-7-11-18/h5-14,20-21H,15H2,1-4H3
52 atoms
O  -1.646256 1.582246 0.283972
O  -2.86411 0.571877 -1.306132
O  3.343508 1.050801 -0.144159
C  -3.538955 -1.544913 0.870464
C  -2.240192 -1.973594 0.279168
C  -2.418318 -0.532754 0.776041
C  -3.839362 -2.026225 2.271893
C  -4.778018 -1.42614 0.017847
C  -2.080163 -2.288814 -1.159645
C  -2.373797 0.564623 -0.210104
C  -0.911597 -2.379439 -1.795032
C  -0.846114 -2.740667 -3.24782
C  0.411861 -2.11685 -1.145745
C  -1.288568 2.657282 -0.570476
C  0.19287 2.899188 -0.473288
C  1.070496 1.831182 -0.335995
C  0.694713 4.191638 -0.560549
C  2.436772 2.062904 -0.260783
C  2.063315 4.410347 -0.514723
C  2.941893 3.352513 -0.353178
C  3.0643 -0.05493 0.603314
C  3.558088 -1.267073 0.141062
C  2.370103 0.006449 1.806369
C  3.352705 -2.419823 0.882333
C  2.160661 -1.15707 2.530421
C  2.646274 -2.374187 2.07499
H  -1.603952 -2.555951 0.939854
H  -1.916672 -0.29944 1.708048
H  -4.519794 -1.343502 2.783842
H  -2.936754 -2.112003 2.878562
H  -4.311957 -3.009785 2.245019
H  -5.26637 -2.399885 -0.054979
H  -4.582801 -1.067044 -0.987618
H  -5.487833 -0.737624 0.479223
H  -2.985334 -2.474444 -1.726914
H  -0.368055 -1.946416 -3.826306
H  -1.834281 -2.913412 -3.671789
H  -0.249029 -3.642964 -3.403474
H  0.943971 -1.319041 -1.670662
H  1.058083 -2.996402 -1.197905
H  0.33844 -1.827878 -0.098431
H  -1.839336 3.548346 -0.258517
H  -1.575374 2.439181 -1.6016
H  0.691878 0.819035 -0.275458
H  0.01705 5.030685 -0.659984
H  2.450324 5.418259 -0.583774
H  4.009824 3.515846 -0.296633
H  4.101308 -1.297875 -0.794383
H  1.994735 0.950889 2.177895
H  3.740883 -3.361496 0.516896
H  1.619789 -1.10514 3.466267
H  2.480998 -3.276744 2.64744
totalener: -1117.84254052 hartree
nucrepener: 2347.84587581 hartree
electener: -3465.68841633 hartree
oneelecener: -6184.36186106 hartree
twoeener: 2718.67344474 hartree
kineticenergy: 1112.85272847 hartree
xcener: -110.236051472415 hartree
chargesum: 0.0000000
charge: -0.278497 -0.377561 -0.297212 0.151977 -0.033539 -0.099883 -0.238288 -0.288124 -0.170243 0.334589 0.015879 -0.216669 -0.260758 0.041188 0.008592 -0.119678 -0.179606 0.258777 -0.083965 -0.217624 0.251431 -0.188113 -0.155601 -0.123050 -0.135866 -0.125918 0.086997 0.077868 0.090167 0.069577 0.088512 0.090689 0.104152 0.085903 0.082396 0.086968 0.079260 0.082398 0.085704 0.097803 0.052468 0.093085 0.113841 0.071946 0.107079 0.124298 0.124716 0.124025 0.131713 0.125799 0.125904 0.124494
qa: -0.2785 -0.3776 -0.2972 0.1520 -0.0335 -0.0999 -0.2383 -0.2881 -0.1702 0.3346 0.0159 -0.2167 -0.2608 0.0412 0.0086 -0.1197 -0.1796 0.2588 -0.0840 -0.2176 0.2514 -0.1881 -0.1556 -0.1230 -0.1359 -0.1259 0.0870 0.0779 0.0902 0.0696 0.0885 0.0907 0.1042 0.0859 0.0824 0.0870 0.0793 0.0824 0.0857 0.0978 0.0525 0.0931 0.1138 0.0719 0.1071 0.1243 0.1247 0.1240 0.1317 0.1258 0.1259 0.1245
va: 2.1169 2.1125 2.1169 3.7567 3.8531 3.8467 3.8949 3.9134 3.9046 4.1746 3.7987 3.9394 3.9594 3.8741 3.7989 3.9104 3.9976 3.7829 3.9581 4.0354 3.7941 3.9438 3.9109 3.8989 3.9365 3.9150 1.0073 1.0332 1.0052 1.0072 1.0047 0.9977 1.0209 1.0044 1.0128 0.9997 1.0116 0.9974 0.9926 1.0025 1.0076 0.9971 1.0165 1.0153 1.0122 0.9995 1.0140 1.0157 1.0040 0.9997 1.0005 1.0002
dispcorr: -0.028349694 hartree
energy: -1117.870890212489
dipole: -14.84656 14.99135 0.14478 -17.17110 17.03479 -0.13632 -1.17659 1.78981 0.61321
magnitude: 0.64465 au
magnitude: 1.63857 debye
