program: Gaussian 09
title: 000069461
version: EM64L-G09RevD.01
frameworkgroup: C1[X(C9H8O5)]
method: RPBEPBE
basis: SDD
operation: Freq
keyword: #p
keyword: freq=noraman
keyword: PBEPBE/SDD
title: #p freq=noraman PBEPBE/SDD
converged: YES YES NO NO
title: Mulliken charges:
elementType: O O O O O C C C C C C C C C H H H H H H H H
charge: -0.215010 -0.451875 -0.210270 -0.427729 -0.176130 0.259050 0.121826 -0.341563 -0.289876 -0.228648 -0.242232 -0.339304 0.106950 0.165418 0.248970 0.282268 0.232199 0.236773 0.255098 0.242855 0.381216 0.390014
chargesum: 0.00000
title: Mulliken charges with hydrogens summed into heavy atoms:
elementType: O O O O O C C C C C C C C C
charge: -0.215010 -0.070659 -0.210270 -0.037716 -0.176130 0.259050 0.121826 -0.092593 -0.007608 0.003551 -0.005458 0.158648 0.106950 0.165418
polarizability: 1.50084664e+02 -4.50696975e+00 1.38908358e+02 6.18498485e+00 1.31434605e+00 5.30425679e+01
1716.lowfreq: -6.8659 0.0003 0.0008 0.0009 1.2261 7.4803 22.1645 29.8265 53.9751
frequency: 22.1394 29.7991 53.9704 80.7234 114.3369 138.8020 192.8246 226.0291 240.6027 307.6413 365.0858 414.9236 452.2284 511.7221 519.4258 539.5169 547.3700 585.2158 599.6922 613.0089 641.6940 684.1727 722.7796 762.1199 772.5047 813.0869 861.6338 883.1585 962.0165 977.3717 991.8256 993.2543 1003.5225 1051.0444 1056.2485 1117.7635 1162.6953 1179.7899 1207.3616 1231.4673 1258.6024 1281.1635 1302.4951 1370.4490 1393.0326 1429.8546 1449.2662 1485.3970 1586.8333 1603.3251 1656.4180 1709.9506 2961.5554 3037.9190 3137.4824 3158.7195 3170.7760 3187.2553 3524.1837 3530.7371
redmass: 11.8124 10.1737 6.0811 8.4083 3.6917 3.0844 7.4586 7.4717 5.4491 7.0335 8.7315 3.7065 4.5596 2.6897 2.8016 4.7245 3.7326 1.2755 4.5140 4.5865 1.6576 3.7194 5.5882 1.8759 2.2003 6.7572 1.5277 4.3023 1.3905 4.9970 1.8454 1.8235 3.2240 2.3042 2.4108 1.9007 1.6760 1.0710 1.0957 3.5483 1.6657 1.7035 2.1139 2.4287 3.2503 2.2039 1.1535 2.2591 7.1088 6.3208 8.8470 9.4483 1.0592 1.1001 1.0866 1.0908 1.0957 1.0970 1.0642 1.0641
irintensity: 0.7209 1.5075 0.2155 1.0657 7.6018 1.5219 0.2109 0.5346 0.1187 0.3447 6.5266 10.7477 17.9077 30.3853 16.6551 26.0590 4.4117 115.9278 43.4482 28.3527 107.6991 66.1344 2.9773 85.8010 14.4427 9.2426 1.1109 0.6670 12.8751 389.8425 42.4335 99.5293 63.9485 24.1212 152.5875 58.8658 72.5440 8.7944 1.1346 154.5470 18.6904 26.9072 57.9489 14.3726 0.9599 43.0939 50.7343 76.8799 48.9573 27.1307 296.4165 204.1393 38.8278 14.5594 4.4957 18.5644 11.3207 5.8274 36.8774 38.9485
temp: 298.150 k
press: 1.00000 atm
elementType: 8 8 8 8 8 6 6 6 6 6 6 6 6 6 1 1 1 1 1 1 1 1
symmnumber: 1
zpe: 411910.1 jmol-1
zpe.correction: 0.156888 hartree
zpe.thermalcorrener: 0.169824 hartree
zpe.thermalcorrenthalpy: 0.170768 hartree
zpe.thermalcorrgfe: 0.114935 hartree
zpe.sumelectzpe: -722.848000 hartree
zpe.sumelectthermal: -722.835064 hartree
zpe.sumelectthermalent: -722.834120 hartree
zpe.sumelectthermalfe: -722.889953 hartree
dipole: 0.0031 -4.0492 0.0114
dipole: 4.0492
quadrupole: -61.9843 -74.7101 -83.2263
quadrupole: 6.2711 0.1121 -0.8062
quadrupole: 11.3226 -1.4032 -9.9194 6.2711 0.1121 -0.8062
hfenergy: -723.0048884 hartree
pointgroup: C01[X(C9H8O5)]
dipole: -0.3313592 1.5581447 0.0180672 debye
dipolederiv: -1.738782 -0.2584683 -0.0482357 -0.0148827 -0.19101 -0.0026908 -0.0519512 -0.0103703 -0.2395233 -0.7459111 -0.5657378 0.1118102 -0.5110795 -0.9175889 0.1668486 0.1095884 0.2149899 -0.4722877 -0.7566048 0.1595946 0.1891346 0.2408428 -0.8016069 -0.0965007 0.1730743 -0.0265311 -0.3691818 -0.986372 -0.5214697 0.2216507 -0.4702153 -0.6863448 0.1196906 0.2082176 0.1041794 -0.4853623 -0.6765561 0.1681822 -0.0666396 -0.0542696 -0.7808559 0.2207193 0.0255173 0.2155116 -0.3746754 1.4946996 0.1831123 0.0539423 -0.4649879 0.1560102 -0.0068801 0.0377913 -0.0301623 0.1222923 -0.3263572 0.2764117 0.0333876 -0.0752568 -0.6530872 -0.0273765 0.0151312 -0.0315223 -0.0421641 -0.3853544 0.0028723 -0.0113304 0.4432203 -0.0716354 0.0057885 -0.0067431 0.0009346 -0.2090547 0.0680812 -0.276542 -0.0108357 0.0378426 0.2348316 0.0042727 -0.0124749 0.0510062 -0.0926918 0.2569929 0.1615368 0.0043669 -0.0138034 0.2023148 0.0034789 -0.0016819 0.0013964 -0.1174109 0.006158 -0.1057639 -0.014216 -0.1221527 -0.4085263 -0.0096969 -0.0107227 -0.0001829 -0.1895526 0.5280892 0.2545669 0.0101401 0.7272556 0.2489068 0.0710157 0.0459112 0.0445626 0.3744077 1.1942144 0.0937298 -0.3913774 0.1511808 1.9251398 -0.0118369 -0.3364725 -0.0800789 0.3654319 1.5643146 0.2075431 -0.1114369 0.2325896 1.2241393 -0.4357452 -0.1693913 -0.4043264 0.3817938 -0.0036208 -0.1044889 0.0031543 -0.1066749 0.0084286 -0.0036431 -0.0022112 -0.0009791 0.170157 0.0511488 -0.0662852 -0.0023724 -0.0654613 0.0708901 -0.0037737 0.0070123 -0.0132809 0.1551012 0.0695835 0.0511481 0.0019268 0.0688885 -0.0936346 -0.0048536 0.0042979 -0.0043106 0.1535511 -0.1040607 0.0527608 0.0079994 0.0382304 0.0696131 -0.0038755 0.0053332 -0.0082982 0.1701465 0.0060727 -0.0031628 -0.015657 -0.1404471 -0.0004517 0.0655193 0.0039593 0.0846781 -0.0288673 0.0067025 0.0293912 0.027964 -0.1361526 -0.0146624 -0.0788696 -0.0307272 -0.0882629 -0.0264714 0.2507883 0.1612983 0.0492641 0.0948818 0.2302226 -0.033299 0.0429585 -0.0829579 0.3761504 0.2267734 0.0997703 -0.0426401 0.1404516 0.2489073 0.0617082 -0.0564166 0.0640052 0.3782112 unknown
polarizability: 151.6047861|-1.7580416|137.6124574|-4.0686757|-1.5449809|52.8183463 unknown
InChI: InChI=1S/C9H8O5/c10-8(11)5-14-7-4-2-1-3-6(7)9(12)13/h1-4,10,12H,5H2
charge 0 multiplicity 1
22 atoms
O  0.918143 0.05857 0.11794
O  -2.061948 -2.924122 0.322655
O  0.106108 -2.537479 -0.403335
O  4.239821 1.442408 -0.065765
O  3.563317 -0.625292 0.776322
C  -0.43021 0.42408 0.101751
C  -1.392599 -0.636545 0.08121
C  -0.86744 1.773719 0.132795
C  -2.771723 -0.302294 0.131678
C  -2.245322 2.073179 0.164687
C  -3.204867 1.03712 0.172507
C  1.903024 1.130006 0.162637
C  -0.989979 -2.065417 -0.030833
C  3.277834 0.495941 0.331687
H  -0.146263 2.59544 0.130386
H  -3.494049 -1.122265 0.131103
H  -2.564686 3.120997 0.185887
H  -4.273559 1.269543 0.203888
H  1.891241 1.735987 -0.76301
H  1.731172 1.804613 1.028042
H  -1.749211 -3.860705 0.203065
H  5.151398 1.073514 0.087701
