program: Orca
programVersion: 5.0.2
elementType: O O O C C C C C C C C C C C C C C C C C C C C C C C H H H H H H H H H H H H H H H H H H H H H H H H H H
charge: 0
multiplicity: 1
keywords: wb97x-d3
keywords: def2-TZVPP
keywords: def2/J RIJCOSX
keywords: DEFGRID2
keywords: scfconv7
keywords: smallprint printgap noloewdin
keywords: NOSOSCF
formula: C23H26O3
InChI: InChI=1/C23H26O3/c1-16(2)13-20-21(23(20,3)4)22(24)25-15-17-9-8-12-19(14-17)26-18-10-6-5-7-11-18/h5-14,20-21H,15H2,1-4H3
52 atoms
O  -1.962222 0.593983 -1.192453
O  -2.684203 2.423627 -0.137899
O  2.704531 0.965847 0.892973
C  -4.238082 -0.841902 0.312895
C  -2.939435 -1.123342 0.995726
C  -3.3469 0.320674 0.704031
C  -5.495164 -0.989685 1.13906
C  -4.453058 -1.217279 -1.133139
C  -1.821463 -1.831169 0.331283
C  -2.649432 1.22682 -0.232427
C  -0.637439 -2.101001 0.884818
C  0.389438 -2.912851 0.15409
C  -0.222091 -1.627663 2.243971
C  -1.1929 1.405057 -2.066922
C  0.041925 1.96168 -1.412402
C  0.804331 1.171992 -0.559746
C  0.44666 3.260663 -1.690134
C  1.964661 1.68958 -0.002424
C  1.611068 3.764072 -1.133403
C  2.381656 2.979375 -0.290868
C  3.225157 -0.239383 0.540282
C  3.566491 -1.091353 1.585299
C  3.453546 -0.621909 -0.776348
C  4.128832 -2.325982 1.310972
C  4.014096 -1.86528 -1.033971
C  4.352425 -2.723728 0.000037
H  -3.033651 -1.356645 2.052224
H  -3.695568 0.879745 1.564625
H  -5.850859 -2.021582 1.114539
H  -6.294078 -0.351862 0.75672
H  -5.330802 -0.723129 2.183809
H  -3.569231 -1.111142 -1.754378
H  -5.237384 -0.5972 -1.570666
H  -4.782719 -2.256017 -1.198771
H  -2.003614 -2.205821 -0.669643
H  0.048906 -3.201554 -0.839702
H  0.630159 -3.82594 0.704618
H  1.328988 -2.3672 0.04458
H  0.009085 -2.47134 2.899125
H  -0.972915 -1.011814 2.734765
H  0.691673 -1.032875 2.17415
H  -1.797776 2.212846 -2.484958
H  -0.914634 0.737792 -2.884385
H  0.483906 0.164898 -0.314903
H  -0.160955 3.88784 -2.330035
H  1.918473 4.778511 -1.34933
H  3.289193 3.362474 0.156406
H  3.388561 -0.776866 2.605537
H  3.201164 0.037293 -1.596163
H  4.388551 -2.983355 2.130235
H  4.189114 -2.159898 -2.060405
H  4.787158 -3.690902 -0.211838
totalener: -1117.84152482 hartree
nucrepener: 2362.69287672 hartree
electener: -3480.53440154 hartree
oneelecener: -6214.06512037 hartree
twoeener: 2733.53071883 hartree
kineticenergy: 1112.86624646 hartree
xcener: -110.239625394437 hartree
chargesum: 0.0000000
charge: -0.272855 -0.353519 -0.300346 0.129943 -0.027837 -0.101387 -0.241280 -0.284793 -0.163728 0.334626 -0.040376 -0.176906 -0.239081 0.024937 0.025706 -0.148272 -0.128357 0.198805 -0.108377 -0.169807 0.241072 -0.233988 -0.144998 -0.083181 -0.121216 -0.152080 0.087272 0.084936 0.086898 0.091411 0.071783 0.086779 0.094447 0.094178 0.082637 0.079354 0.095032 0.032436 0.093273 0.087517 0.075235 0.104861 0.097594 0.111839 0.105302 0.123758 0.124471 0.131844 0.123456 0.123543 0.123853 0.123582
qa: -0.2729 -0.3535 -0.3003 0.1299 -0.0278 -0.1014 -0.2413 -0.2848 -0.1637 0.3346 -0.0404 -0.1769 -0.2391 0.0249 0.0257 -0.1483 -0.1284 0.1988 -0.1084 -0.1698 0.2411 -0.2340 -0.1450 -0.0832 -0.1212 -0.1521 0.0873 0.0849 0.0869 0.0914 0.0718 0.0868 0.0944 0.0942 0.0826 0.0794 0.0950 0.0324 0.0933 0.0875 0.0752 0.1049 0.0976 0.1118 0.1053 0.1238 0.1245 0.1318 0.1235 0.1235 0.1239 0.1236
va: 2.0845 2.1578 2.0953 3.7708 3.7738 3.8505 3.9031 3.9183 3.8581 4.2305 3.7855 3.9404 3.9562 3.8888 3.7503 3.9469 3.9805 3.7930 3.9636 4.0384 3.7907 3.9556 3.8823 3.9207 3.9361 3.9565 1.0077 1.0284 1.0038 1.0045 1.0087 1.0165 1.0026 1.0000 1.0147 1.0162 1.0011 1.0045 0.9997 1.0129 1.0061 1.0090 0.9909 1.0098 1.0111 1.0002 1.0117 1.0126 1.0116 0.9995 1.0015 1.0016
dispcorr: -0.029961834 hartree
energy: -1117.871486650655
dipole: -13.96616 14.04337 0.07721 -16.95358 16.08203 -0.87154 2.20071 -2.64416 -0.44345
magnitude: 0.98092 au
magnitude: 2.49329 debye
