program: Orca
programVersion: 5.0.2
elementType: O O O C C C C C C C C C C C C C C C C C C C C C C C H H H H H H H H H H H H H H H H H H H H H H H H H H
charge: 0
multiplicity: 1
keywords: wb97x-d3
keywords: def2-TZVPP
keywords: def2/J RIJCOSX
keywords: DEFGRID2
keywords: scfconv7
keywords: smallprint printgap noloewdin
keywords: NOSOSCF
formula: C23H26O3
InChI: InChI=1/C23H26O3/c1-16(2)13-20-21(23(20,3)4)22(24)25-15-17-9-8-12-19(14-17)26-18-10-6-5-7-11-18/h5-14,20-21H,15H2,1-4H3
52 atoms
O  -1.281673 -0.297513 2.013598
O  -2.678614 1.218811 1.154478
O  2.959174 0.42173 -0.967415
C  -4.362046 -1.130922 0.082722
C  -3.220615 -1.045962 -0.873813
C  -2.957792 -1.107746 0.638822
C  -5.053688 -2.472072 0.188253
C  -5.314968 0.024404 0.271136
C  -2.894597 0.172795 -1.651095
C  -2.341069 0.072157 1.275837
C  -1.745128 0.367742 -2.299263
C  -1.482939 1.630692 -3.060875
C  -0.621859 -0.624359 -2.31251
C  -0.470545 0.756704 2.524981
C  0.363168 1.381885 1.440538
C  1.301383 0.601457 0.774097
C  0.189101 2.70968 1.076213
C  2.068179 1.156168 -0.239933
C  0.959807 3.255358 0.060861
C  1.903368 2.486811 -0.600116
C  3.687474 -0.560313 -0.360645
C  3.813744 -1.770264 -1.026542
C  4.332701 -0.353564 0.852808
C  4.590579 -2.777768 -0.475073
C  5.099633 -1.371795 1.396356
C  5.233282 -2.58619 0.738356
H  -2.973837 -1.978155 -1.373528
H  -2.575363 -2.05378 1.004703
H  -5.830431 -2.56447 -0.573021
H  -5.528046 -2.590548 1.164061
H  -4.360664 -3.303846 0.054047
H  -5.796369 -0.040686 1.248278
H  -6.100396 -0.027269 -0.485482
H  -4.842268 0.998611 0.206972
H  -3.643552 0.955543 -1.687755
H  -0.640388 2.169781 -2.620183
H  -2.344921 2.296449 -3.0610
H  -1.215838 1.421855 -4.099982
H  -0.761593 -1.439485 -1.605142
H  0.322982 -0.137168 -2.066566
H  -0.498773 -1.058502 -3.308511
H  0.164824 0.278327 3.270943
H  -1.07823 1.509374 3.030971
H  1.422932 -0.441946 1.040591
H  -0.562688 3.309228 1.57129
H  0.822299 4.28996 -0.224117
H  2.507388 2.904691 -1.394796
H  3.305933 -1.913723 -1.971256
H  4.239291 0.593931 1.367975
H  4.686307 -3.720415 -0.997532
H  5.602928 -1.209009 2.340286
H  5.83536 -3.375298 1.167807
totalener: -1117.84310144 hartree
nucrepener: 2329.85708867 hartree
electener: -3447.70019011 hartree
oneelecener: -6148.74856330 hartree
twoeener: 2701.04837319 hartree
kineticenergy: 1112.86853849 hartree
xcener: -110.234979233472 hartree
chargesum: 0.0000000
charge: -0.272361 -0.385019 -0.305431 0.145777 -0.063105 -0.091487 -0.243638 -0.276929 -0.161820 0.347265 -0.010773 -0.203751 -0.272079 0.058416 0.005645 -0.166999 -0.098081 0.188815 -0.111151 -0.218690 0.236583 -0.205349 -0.156722 -0.094252 -0.121081 -0.140311 0.088806 0.077688 0.088838 0.089656 0.070529 0.083912 0.088378 0.101443 0.085623 0.080180 0.077333 0.084396 0.080647 0.087242 0.103842 0.110608 0.100495 0.120742 0.110778 0.125374 0.127600 0.123797 0.131548 0.125043 0.126442 0.125588
qa: -0.2724 -0.3850 -0.3054 0.1458 -0.0631 -0.0915 -0.2436 -0.2769 -0.1618 0.3473 -0.0108 -0.2038 -0.2721 0.0584 0.0056 -0.1670 -0.0981 0.1888 -0.1112 -0.2187 0.2366 -0.2053 -0.1567 -0.0943 -0.1211 -0.1403 0.0888 0.0777 0.0888 0.0897 0.0705 0.0839 0.0884 0.1014 0.0856 0.0802 0.0773 0.0844 0.0806 0.0872 0.1038 0.1106 0.1005 0.1207 0.1108 0.1254 0.1276 0.1238 0.1315 0.1250 0.1264 0.1256
va: 2.1161 2.1014 2.0565 3.7521 3.8685 3.8439 3.8987 3.9062 3.8891 4.1801 3.7537 3.9404 3.9527 3.8764 3.6946 3.8601 3.9515 3.7112 3.9366 3.9964 3.8334 4.0276 3.9459 3.9368 3.9511 3.9568 1.0038 1.0314 1.0046 1.0053 1.0068 1.0044 0.9981 1.0242 1.0148 1.0016 1.0122 0.9992 1.0081 1.0004 1.0005 0.9915 1.0106 1.0220 1.0192 0.9993 1.0123 1.0137 1.0050 0.9993 1.0001 1.0003
dispcorr: -0.028046243 hartree
energy: -1117.871147681238
dipole: -18.69678 19.02965 0.33288 -4.93515 4.38712 -0.54803 -8.04409 8.29050 0.24640
magnitude: 0.68692 au
magnitude: 1.74602 debye
