program: Orca
programVersion: 5.0.2
elementType: O O O C C C C C C C C C C C C C C C C C C C C C C C H H H H H H H H H H H H H H H H H H H H H H H H H H
charge: 0
multiplicity: 1
keywords: wb97x-d3
keywords: def2-TZVPP
keywords: def2/J RIJCOSX
keywords: DEFGRID2
keywords: scfconv7
keywords: smallprint printgap noloewdin
keywords: NOSOSCF
formula: C23H26O3
InChI: InChI=1/C23H26O3/c1-16(2)13-20-21(23(20,3)4)22(24)25-15-17-9-8-12-19(14-17)26-18-10-6-5-7-11-18/h5-14,20-21H,15H2,1-4H3
52 atoms
O  0.21973 -2.215368 0.641642
O  0.668719 -2.699717 -1.488017
O  2.974227 2.119546 0.383781
C  -2.723356 -2.522374 -0.334418
C  -2.372154 -1.096906 -0.02239
C  -1.48763 -1.897859 -0.958531
C  -3.853367 -2.830774 -1.28679
C  -2.591708 -3.549823 0.763425
C  -3.127721 0.046583 -0.571223
C  -0.108085 -2.311015 -0.642755
C  -3.556513 1.118449 0.104446
C  -4.308088 2.21111 -0.595254
C  -3.35292 1.349167 1.570454
C  1.563255 -2.545901 1.008492
C  2.543661 -1.523558 0.507743
C  2.277735 -0.17036 0.688895
C  3.71803 -1.919608 -0.1200
C  3.176933 0.774161 0.215789
C  4.625196 -0.964827 -0.557833
C  4.356532 0.386227 -0.405333
C  1.703509 2.634033 0.288747
C  0.825049 2.244464 -0.715802
C  1.344275 3.609609 1.206935
C  -0.426758 2.838213 -0.787579
C  0.09324 4.204222 1.115069
C  -0.798564 3.818485 0.124296
H  -1.969126 -0.953564 0.973573
H  -1.597316 -1.672528 -2.014061
H  -3.737403 -3.835606 -1.6970
H  -3.904765 -2.139241 -2.126602
H  -4.812464 -2.796447 -0.766354
H  -2.277918 -4.515308 0.361511
H  -3.561982 -3.695954 1.241741
H  -1.890381 -3.261684 1.543001
H  -3.349657 0.002712 -1.633829
H  -5.285288 2.374514 -0.133334
H  -4.466369 1.993323 -1.651275
H  -3.773148 3.161913 -0.522723
H  -2.749274 0.586613 2.058658
H  -4.316396 1.387253 2.085464
H  -2.873497 2.315875 1.743461
H  1.826262 -3.54595 0.659684
H  1.548771 -2.567015 2.097686
H  1.371751 0.142907 1.194013
H  3.922189 -2.972272 -0.269878
H  5.539898 -1.273344 -1.046465
H  5.0519 1.133668 -0.765092
H  1.108564 1.490377 -1.439138
H  2.039598 3.904234 1.982667
H  -1.1118 2.536321 -1.569228
H  -0.184746 4.967604 1.829813
H  -1.774053 4.281763 0.058774
elementType: O C H
totalener: -1117.85527799 hartree
nucrepener: 2338.08788099 hartree
electener: -3455.94315898 hartree
oneelecener: -6165.79371881 hartree
twoeener: 2709.85055983 hartree
cpcmener: -0.03306671 hartree
kineticenergy: 1112.80378923 hartree
xcener: -110.230942000063 hartree
chargesum: -0.0000000
charge: -0.285764 -0.497056 -0.343903 0.095629 0.085109 -0.121635 -0.274872 -0.275266 -0.306937 0.435744 -0.081443 -0.216011 -0.247372 0.077626 0.037257 -0.226539 -0.231479 0.272193 -0.113581 -0.256559 0.289010 -0.184658 -0.251368 -0.144928 -0.113637 -0.224266 0.103557 0.089375 0.098807 0.089042 0.097299 0.101770 0.095705 0.091537 0.121567 0.102549 0.092332 0.087405 0.092099 0.106565 0.087646 0.119888 0.121401 0.144395 0.145489 0.161256 0.149354 0.156396 0.147566 0.164668 0.160645 0.176393
qa: -0.2858 -0.4971 -0.3439 0.0956 0.0851 -0.1216 -0.2749 -0.2753 -0.3069 0.4357 -0.0814 -0.2160 -0.2474 0.0776 0.0373 -0.2265 -0.2315 0.2722 -0.1136 -0.2566 0.2890 -0.1847 -0.2514 -0.1449 -0.1136 -0.2243 0.1036 0.0894 0.0988 0.0890 0.0973 0.1018 0.0957 0.0915 0.1216 0.1025 0.0923 0.0874 0.0921 0.1066 0.0876 0.1199 0.1214 0.1444 0.1455 0.1613 0.1494 0.1564 0.1476 0.1647 0.1606 0.1764
va: 2.1090 2.0022 2.0611 3.7301 3.6837 3.8459 3.9130 3.9074 3.8108 4.1200 3.7768 3.9060 3.9262 3.8133 3.6155 3.9096 3.9611 3.7133 3.8866 4.0099 3.6699 3.9121 4.0184 3.8427 3.8847 3.8583 1.0214 1.0345 1.0011 1.0063 1.0014 0.9994 1.0004 1.0139 1.0107 0.9985 1.0080 0.9987 1.0107 0.9981 1.0009 1.0057 0.9956 1.0127 1.0027 0.9876 1.0054 0.9994 1.0070 0.9888 0.9889 0.9792
dispcorr: -0.028002225 hartree
energy: -1117.883280219472
dipole: -29.27676 27.93806 -1.33870 -2.75054 2.82392 0.07339 1.91482 -0.81030 1.10452
magnitude: 1.73709 au
magnitude: 4.41533 debye
