program: Orca
programVersion: 5.0.2
elementType: O O O C C C C C C C C C C C C C C C C C C C C C C C H H H H H H H H H H H H H H H H H H H H H H H H H H
charge: 0
multiplicity: 1
keywords: wb97x-d3
keywords: def2-TZVPP
keywords: def2/J RIJCOSX
keywords: DEFGRID2
keywords: scfconv7
keywords: smallprint printgap noloewdin
keywords: NOSOSCF
formula: C23H26O3
InChI: InChI=1/C23H26O3/c1-16(2)13-20-21(23(20,3)4)22(24)25-15-17-9-8-12-19(14-17)26-18-10-6-5-7-11-18/h5-14,20-21H,15H2,1-4H3
52 atoms
O  -0.090011 -1.976563 -0.207486
O  0.220383 -1.490011 1.947593
O  3.432089 1.634173 -0.838769
C  -2.154606 0.336772 -0.143739
C  -2.823582 -1.003138 -0.123059
C  -1.736522 -0.692127 0.89479
C  -2.877691 1.545567 0.401881
C  -1.275417 0.681142 -1.320416
C  -4.2039 -1.209634 0.353803
C  -0.448445 -1.406112 0.940079
C  -5.120127 -2.023766 -0.182045
C  -6.484756 -2.143969 0.427838
C  -4.907329 -2.882785 -1.390821
C  1.150969 -2.680908 -0.244118
C  2.349925 -1.784863 -0.100789
C  2.317662 -0.470916 -0.546629
C  3.521384 -2.293507 0.451222
C  3.440652 0.331195 -0.403568
C  4.647993 -1.491378 0.553574
C  4.613795 -0.167177 0.139541
C  2.367155 2.433316 -0.498328
C  1.914499 3.332395 -1.453225
C  1.789902 2.390401 0.765791
C  0.878372 4.200448 -1.13632
C  0.749452 3.258262 1.064895
C  0.287864 4.164925 0.119173
H  -2.504529 -1.658862 -0.924883
H  -2.088634 -0.465108 1.8951
H  -3.453024 1.331797 1.301449
H  -3.563131 1.94839 -0.346457
H  -2.162768 2.332431 0.650036
H  -0.824864 -0.186785 -1.79566
H  -0.476503 1.36571 -1.026844
H  -1.8748 1.188337 -2.079088
H  -4.490196 -0.649172 1.239126
H  -7.259559 -1.847893 -0.284021
H  -6.593179 -1.528105 1.320242
H  -6.699954 -3.179626 0.703547
H  -4.972328 -3.94123 -1.124225
H  -3.951049 -2.725726 -1.88592
H  -5.693845 -2.704746 -2.128442
H  1.156742 -3.167494 -1.219505
H  1.166722 -3.466607 0.514166
H  1.423006 -0.061634 -0.99882
H  3.550958 -3.316348 0.805906
H  5.556366 -1.891449 0.984175
H  5.482347 0.470362 0.242011
H  2.372579 3.355537 -2.433879
H  2.144901 1.694955 1.51589
H  0.528599 4.901936 -1.882377
H  0.300585 3.22576 2.04909
H  -0.523374 4.838512 0.360758
elementType: O C H
totalener: -1117.85538338 hartree
nucrepener: 2322.16745806 hartree
electener: -3440.02284144 hartree
oneelecener: -6133.92563319 hartree
twoeener: 2693.90279175 hartree
cpcmener: -0.03239027 hartree
kineticenergy: 1112.79712923 hartree
xcener: -110.231965255680 hartree
chargesum: 0.0000000
charge: -0.286676 -0.495156 -0.346818 0.125359 0.055857 -0.091505 -0.283449 -0.257312 -0.300713 0.416142 -0.049751 -0.220668 -0.255051 0.064269 0.014243 -0.199933 -0.219589 0.223615 -0.123975 -0.235703 0.250625 -0.211629 -0.146763 -0.134102 -0.183436 -0.181296 0.103209 0.089260 0.093556 0.099565 0.092461 0.099510 0.030157 0.110059 0.120942 0.094436 0.088964 0.092827 0.098601 0.089730 0.094893 0.122025 0.123270 0.188883 0.144716 0.160213 0.149254 0.147102 0.153366 0.160276 0.163730 0.162412
qa: -0.2867 -0.4952 -0.3468 0.1254 0.0559 -0.0915 -0.2834 -0.2573 -0.3007 0.4161 -0.0498 -0.2207 -0.2551 0.0643 0.0142 -0.1999 -0.2196 0.2236 -0.1240 -0.2357 0.2506 -0.2116 -0.1468 -0.1341 -0.1834 -0.1813 0.1032 0.0893 0.0936 0.0996 0.0925 0.0995 0.0302 0.1101 0.1209 0.0944 0.0890 0.0928 0.0986 0.0897 0.0949 0.1220 0.1233 0.1889 0.1447 0.1602 0.1493 0.1471 0.1534 0.1603 0.1637 0.1624
va: 2.1124 1.9933 2.0577 3.6261 3.7688 3.8304 3.9142 3.9027 3.8743 4.1524 3.7660 3.9210 3.9409 3.8107 3.6164 3.8961 3.9661 3.7698 3.8872 3.9995 3.7007 3.9551 3.8186 3.8738 3.8521 3.8390 1.0244 1.0338 1.0082 1.0014 1.0080 1.0121 1.0267 1.0040 1.0121 0.9961 1.0088 0.9958 0.9959 1.0113 0.9974 0.9944 1.0066 0.9769 1.0001 0.9876 1.0044 1.0063 1.0015 0.9882 0.9898 0.9887
dispcorr: -0.028211483 hartree
energy: -1117.883594861914
dipole: -31.27422 30.08858 -1.18564 -3.60365 3.29137 -0.31228 -3.74186 2.71032 -1.03155
magnitude: 1.60230 au
magnitude: 4.07272 debye
