program: Orca
programVersion: 5.0.2
elementType: O O O C C C C C C C C C C C C C C C C C C C C C C C H H H H H H H H H H H H H H H H H H H H H H H H H H
charge: 0
multiplicity: 1
keywords: wb97x-d3
keywords: def2-TZVPP
keywords: def2/J RIJCOSX
keywords: DEFGRID2
keywords: scfconv7
keywords: smallprint printgap noloewdin
keywords: NOSOSCF
formula: C23H26O3
InChI: InChI=1/C23H26O3/c1-16(2)13-20-21(23(20,3)4)22(24)25-15-17-9-8-12-19(14-17)26-18-10-6-5-7-11-18/h5-14,20-21H,15H2,1-4H3
52 atoms
O  0.76176 -2.642748 -1.014727
O  0.255092 -2.232215 1.123389
O  2.616501 2.018602 -0.514256
C  -2.700846 -2.051731 0.097183
C  -2.102605 -0.683681 0.038474
C  -1.368168 -1.844937 -0.601796
C  -3.860398 -2.368979 -0.815057
C  -2.783899 -2.759966 1.426255
C  -2.630714 0.397224 -0.832975
C  -0.07297 -2.258454 -0.04088
C  -3.6066 1.237401 -0.480921
C  -4.052363 2.340989 -1.388924
C  -4.308787 1.169858 0.839049
C  2.118953 -2.891198 -0.672743
C  2.896871 -1.631066 -0.396677
C  2.361075 -0.366897 -0.596457
C  4.211879 -1.752507 0.049008
C  3.126418 0.758094 -0.312999
C  4.973858 -0.622652 0.29309
C  4.43319 0.646414 0.127067
C  1.39121 2.334483 0.019817
C  0.970648 1.850836 1.253068
C  0.596412 3.213375 -0.703946
C  -0.253416 2.265363 1.761029
C  -0.620948 3.623684 -0.179721
C  -1.052949 3.151994 1.052736
H  -1.667133 -0.349373 0.977702
H  -1.415084 -1.88221 -1.684513
H  -4.796089 -2.021408 -0.371447
H  -3.946478 -3.446313 -0.96774
H  -3.764672 -1.900165 -1.794126
H  -2.644191 -3.836437 1.310839
H  -3.776379 -2.605306 1.854215
H  -2.05965 -2.399924 2.152887
H  -2.169353 0.516443 -1.809104
H  -5.115829 2.251041 -1.624783
H  -3.496853 2.35258 -2.326315
H  -3.925427 3.315224 -0.908626
H  -3.98391 0.334056 1.45702
H  -5.388982 1.082256 0.698085
H  -4.147608 2.09028 1.407337
H  2.537281 -3.406033 -1.537908
H  2.191476 -3.575297 0.175628
H  1.356229 -0.230034 -0.976839
H  4.639846 -2.735796 0.202249
H  5.99591 -0.725912 0.632529
H  5.019002 1.531836 0.336706
H  1.587489 1.168757 1.824284
H  0.932446 3.578655 -1.666061
H  -0.578263 1.891355 2.723181
H  -1.238622 4.308771 -0.745799
H  -2.005571 3.469146 1.456101
elementType: O C H
totalener: -1117.85527000 hartree
nucrepener: 2371.12944409 hartree
electener: -3488.98471409 hartree
oneelecener: -6232.47655123 hartree
twoeener: 2743.49183714 hartree
cpcmener: -0.03122546 hartree
kineticenergy: 1112.79702134 hartree
xcener: -110.230843518547 hartree
chargesum: -0.0000000
charge: -0.299841 -0.488415 -0.345278 0.139702 -0.064415 -0.041492 -0.281072 -0.303202 -0.228386 0.364762 -0.056414 -0.242037 -0.251614 0.090200 0.018350 -0.185807 -0.233858 0.240242 -0.125410 -0.233647 0.278582 -0.168433 -0.230998 -0.184145 -0.157214 -0.152782 0.103922 0.094615 0.098078 0.102811 0.093229 0.105983 0.095765 0.091856 0.123068 0.107636 0.094867 0.089982 0.092423 0.107325 0.098152 0.132248 0.119618 0.152888 0.146668 0.161036 0.149271 0.153141 0.147030 0.161390 0.158385 0.161232
qa: -0.2998 -0.4884 -0.3453 0.1397 -0.0644 -0.0415 -0.2811 -0.3032 -0.2284 0.3648 -0.0564 -0.2420 -0.2516 0.0902 0.0183 -0.1858 -0.2339 0.2402 -0.1254 -0.2336 0.2786 -0.1684 -0.2310 -0.1841 -0.1572 -0.1528 0.1039 0.0946 0.0981 0.1028 0.0932 0.1060 0.0958 0.0919 0.1231 0.1076 0.0949 0.0900 0.0924 0.1073 0.0982 0.1322 0.1196 0.1529 0.1467 0.1610 0.1493 0.1531 0.1470 0.1614 0.1584 0.1612
va: 2.1124 2.0002 2.0565 3.7537 3.7904 3.8288 3.9090 3.8916 3.7723 4.1625 3.6938 3.9224 3.9232 3.8010 3.6383 3.9202 3.9711 3.7482 3.8797 4.0045 3.6799 3.8285 3.9983 3.8633 3.8683 3.8123 1.0235 1.0345 0.9994 1.0032 1.0021 0.9989 1.0005 1.0193 1.0075 0.9990 1.0058 0.9947 1.0062 0.9993 1.0020 0.9916 1.0107 1.0033 0.9987 0.9876 1.0043 1.0007 1.0074 0.9924 0.9900 0.9851
dispcorr: -0.030162854 hartree
energy: -1117.885432851088
dipole: -29.69605 28.82449 -0.87157 -1.06492 0.73967 -0.32525 1.19243 -1.74010 -0.54767
magnitude: 1.07952 au
magnitude: 2.74391 debye
