program: Orca
programVersion: 5.0.2
elementType: O O O C C C C C C C C C C C C C C C C C C C C C C C H H H H H H H H H H H H H H H H H H H H H H H H H H
charge: 0
multiplicity: 1
keywords: wb97x-d3
keywords: def2-TZVPP
keywords: def2/J RIJCOSX
keywords: DEFGRID2
keywords: scfconv7
keywords: smallprint printgap noloewdin
keywords: NOSOSCF
formula: C23H26O3
InChI: InChI=1/C23H26O3/c1-16(2)13-20-21(23(20,3)4)22(24)25-15-17-9-8-12-19(14-17)26-18-10-6-5-7-11-18/h5-14,20-21H,15H2,1-4H3
52 atoms
O  0.423174 -2.428277 0.064375
O  -0.414837 -1.278988 -1.668744
O  3.332182 1.723184 0.851521
C  -2.185266 -0.153846 0.718208
C  -3.000299 -1.016862 -0.198177
C  -1.691906 -1.542579 0.340654
C  -2.624453 0.019185 2.150718
C  -1.518376 1.072975 0.149025
C  -4.260233 -1.66377 0.234308
C  -0.529905 -1.717597 -0.547027
C  -5.477657 -1.390627 -0.243717
C  -6.684459 -2.131105 0.247256
C  -5.752901 -0.358921 -1.295077
C  1.647764 -2.69313 -0.614677
C  2.740988 -1.743545 -0.206589
C  2.477931 -0.424739 0.146139
C  4.054377 -2.203518 -0.217882
C  3.531306 0.425275 0.459828
C  5.094568 -1.347996 0.110793
C  4.842877 -0.026583 0.445265
C  2.29878 2.459877 0.326326
C  1.604086 3.282401 1.201166
C  1.993748 2.44611 -1.029561
C  0.599495 4.105931 0.712149
C  0.977664 3.264333 -1.501528
C  0.277922 4.097215 -0.637862
H  -2.965648 -0.708045 -1.23815
H  -1.757774 -2.273945 1.139232
H  -3.053373 -0.888773 2.573011
H  -3.376605 0.807351 2.223537
H  -1.779635 0.309766 2.777735
H  -0.583885 1.289811 0.671522
H  -2.172948 1.936798 0.278832
H  -1.301263 0.990437 -0.913727
H  -4.173205 -2.425423 1.004044
H  -6.427724 -2.897384 0.978341
H  -7.209639 -2.615843 -0.57987
H  -7.402502 -1.448759 0.709307
H  -4.899061 0.281266 -1.509047
H  -6.580765 0.28509 -0.989549
H  -6.06131 -0.830841 -2.231827
H  1.506031 -2.666556 -1.696701
H  1.923675 -3.712897 -0.34799
H  1.464088 -0.047126 0.183926
H  4.262339 -3.234128 -0.477861
H  6.11355 -1.711629 0.106582
H  5.652127 0.645017 0.701222
H  1.853262 3.282237 2.254723
H  2.540774 1.81146 -1.715272
H  0.061033 4.749193 1.395645
H  0.738145 3.252828 -2.55673
H  -0.510872 4.733907 -1.015414
elementType: O C H
totalener: -1117.85654991 hartree
nucrepener: 2288.73258077 hartree
electener: -3406.58913068 hartree
oneelecener: -6067.23831658 hartree
twoeener: 2660.64918590 hartree
cpcmener: -0.02970330 hartree
kineticenergy: 1112.79333168 hartree
xcener: -110.229938047813 hartree
chargesum: 0.0000000
charge: -0.288571 -0.486752 -0.339427 0.191833 0.017699 -0.136829 -0.272388 -0.327236 -0.297882 0.397168 -0.023938 -0.226385 -0.259105 0.084736 0.012198 -0.195855 -0.222740 0.271047 -0.115060 -0.256040 0.273908 -0.221214 -0.186509 -0.146023 -0.159625 -0.167137 0.096561 0.091304 0.091841 0.097437 0.099681 0.079076 0.110788 0.100405 0.122856 0.089033 0.093881 0.094849 0.090794 0.094470 0.100950 0.112148 0.120233 0.158456 0.142977 0.160141 0.147430 0.146260 0.157476 0.159033 0.161873 0.160176
qa: -0.2886 -0.4868 -0.3394 0.1918 0.0177 -0.1368 -0.2724 -0.3272 -0.2979 0.3972 -0.0239 -0.2264 -0.2591 0.0847 0.0122 -0.1959 -0.2227 0.2710 -0.1151 -0.2560 0.2739 -0.2212 -0.1865 -0.1460 -0.1596 -0.1671 0.0966 0.0913 0.0918 0.0974 0.0997 0.0791 0.1108 0.1004 0.1229 0.0890 0.0939 0.0948 0.0908 0.0945 0.1009 0.1121 0.1202 0.1585 0.1430 0.1601 0.1474 0.1463 0.1575 0.1590 0.1619 0.1602
va: 2.1170 2.0082 2.0701 3.6618 3.7794 3.9053 3.9016 3.9009 3.8900 4.1901 3.7051 3.9263 3.9451 3.8332 3.6932 3.9303 3.9493 3.7538 3.8935 3.9974 3.6810 3.9521 3.8842 3.8639 3.8415 3.8329 1.0269 1.0393 1.0034 1.0027 1.0016 1.0021 1.0015 1.0117 1.0077 1.0083 0.9947 0.9964 1.0063 0.9980 0.9963 1.0138 0.9962 0.9616 1.0024 0.9881 1.0072 1.0077 0.9958 0.9899 0.9902 0.9902
dispcorr: -0.026955716 hartree
energy: -1117.883505629720
dipole: -31.98146 31.36275 -0.61871 -1.06888 0.71223 -0.35665 1.69839 -1.19325 0.50514
magnitude: 0.87473 au
magnitude: 2.22340 debye
