program: Gaussian 09
title: 000074959
version: EM64L-G09RevD.01
frameworkgroup: C1[X(C10H18O3)]
method: RPBEPBE
basis: SDD
operation: Freq
keyword: #pfreq=noraman
keyword: PBEPBE/SDD
title: #p freq=noraman PBEPBE/SDD
converged: YES YES NO NO
title: Mulliken charges:
elementType: O O O C C C C C C C C C C H H H H H H H H H H H H H H H H H H
charge: -0.314225 -0.170703 -0.166156 -0.338713 -0.340360 -0.361007 -0.342912 -0.520580 -0.502508 -0.688838 -0.690637 0.261562 0.244814 0.212374 0.199272 0.217601 0.208643 0.239333 0.186720 0.192763 0.194079 0.255496 0.244648 0.249811 0.247485 0.203458 0.219151 0.215455 0.212436 0.213934 0.217605
chargesum: 0.00000
title: Mulliken charges with hydrogens summed into heavy atoms:
elementType: O O O C C C C C C C C C C
charge: -0.314225 -0.170703 -0.166156 0.072933 0.085884 0.065046 0.043930 -0.020436 -0.005212 -0.050775 -0.046662 0.261562 0.244814
polarizability: 1.57978064e+02 6.09325397e-01 1.07368176e+02 2.45007138e+00 -2.26640305e+00 9.22555677e+01
1716.lowfreq: -35.3202 -6.9820 -0.0009 -0.0007 0.0004 1.8536 14.3543 16.0971 30.7219
frequency: -26.3701 14.9981 30.0937 53.6050 71.2016 75.7340 97.5223 101.8995 114.5577 162.3257 213.7635 227.6683 233.5643 240.1284 263.5772 293.9748 327.9563 442.1043 453.7122 505.5634 534.0551 603.5197 674.3737 720.8391 733.1079 774.3306 790.3449 817.0001 843.5146 888.9456 904.5003 918.5469 929.2242 975.5364 1016.4843 1034.2562 1066.4857 1076.9112 1082.4275 1100.2813 1106.0182 1118.1312 1132.5375 1203.6916 1205.2466 1239.9776 1258.4807 1270.9759 1287.6779 1292.5512 1307.7513 1329.4230 1339.8014 1360.5833 1361.4251 1390.0944 1391.3705 1430.8645 1432.6847 1459.9519 1465.3231 1474.1412 1474.5222 1477.9771 1478.4709 1485.6856 1486.7804 1659.6205 1723.0685 2963.2222 2972.0518 2973.9836 2975.6543 2980.8078 2983.2917 2991.7119 2993.8068 3006.7063 3026.2420 3029.1819 3038.3263 3052.0450 3058.2323 3073.1470 3073.5520 3075.5702 3075.7242
redmass: 1.6848 4.5432 4.7176 3.7353 2.0659 4.2310 3.3368 2.9256 2.1896 4.5740 3.3085 1.4440 1.0989 1.7481 2.9191 4.2337 4.8791 3.3288 3.0681 2.9930 3.2336 3.9602 4.5778 1.1416 1.4117 1.9356 1.4663 2.6207 3.5993 1.6113 1.7911 1.3011 1.5249 5.3774 3.4363 2.8932 2.4192 2.1061 2.1974 1.7451 1.5553 2.4594 2.2669 1.4418 1.3548 1.3412 1.3748 1.1815 1.0603 1.1462 1.2651 1.5059 1.5947 1.6908 1.5489 1.2136 1.2164 1.0875 1.0814 1.0791 1.0702 1.0679 1.0552 1.0430 1.0431 1.0798 1.0764 10.4818 10.9177 1.0590 1.0526 1.0460 1.0363 1.0623 1.0614 1.0621 1.0600 1.0996 1.0957 1.0973 1.0975 1.1017 1.1025 1.1009 1.1009 1.0997 1.0995
irintensity: 0.2160 0.5288 0.3171 0.3798 0.2677 1.5476 0.8382 1.7305 1.8610 1.8174 0.3460 1.0385 0.0351 2.6406 3.3468 3.3643 1.2303 1.9457 4.2431 0.4465 19.2356 0.1347 3.7317 6.5943 24.1854 7.9413 5.1012 52.4066 108.7126 115.4775 9.3487 7.9809 46.5723 1012.4978 1.3903 4.9044 0.4568 4.5534 7.8008 5.9497 0.3775 27.4097 3.3401 0.2880 0.4321 7.6127 36.5200 1.0525 0.3050 1.6852 3.5510 42.4134 18.2591 3.0960 0.6895 10.9093 14.1162 25.2843 36.9367 6.9305 0.9161 4.6857 3.7229 12.9570 11.7955 15.2220 18.8589 93.8918 213.9387 32.2516 33.7417 23.3560 34.2030 7.1637 49.4816 15.4306 37.3369 10.1662 1.9172 0.7301 10.0157 9.4982 14.7780 71.3704 95.8854 56.2945 49.0464
temp: 298.150 k
press: 1.00000 atm
elementType: 8 8 8 6 6 6 6 6 6 6 6 6 6 1 1 1 1 1 1 1 1 1 1 1 1 1 1 1 1 1 1
symmnumber: 1
zpe: 690225.7 jmol-1
zpe.correction: 0.262893 hartree
zpe.thermalcorrener: 0.278522 hartree
zpe.thermalcorrenthalpy: 0.279466 hartree
zpe.thermalcorrgfe: 0.217277 hartree
zpe.sumelectzpe: -616.494775 hartree
zpe.sumelectthermal: -616.479146 hartree
zpe.sumelectthermalent: -616.478201 hartree
zpe.sumelectthermalfe: -616.540391 hartree
dipole: -0.7369 3.5564 -1.1576
dipole: 3.8120
quadrupole: -69.0654 -83.4541 -80.2902
quadrupole: 1.2624 -3.2205 1.3485
quadrupole: 8.5378 -5.8509 -2.6869 1.2624 -3.2205 1.3485
hfenergy: -616.7576677 hartree
pointgroup: C01 [X(C10H18O3)]
dipole: 0.2454863 0.1403573 -1.47284 debye
polarizability: 158.0111203|-0.7806648|91.8998932|-1.6429705|1.0187831|107.6907943 unknown
InChI: InChI=1S/C10H18O3/c1-3-5-7-9(11)13-10(12)8-6-4-2/h3-8H2,1-2H3
charge 0 multiplicity 1
31 atoms
O  -0.002489 0.25262 -0.650935
O  -1.509585 -0.646444 0.924381
O  1.076547 0.753615 1.3865
C  -3.812057 0.262116 -0.651545
C  3.708125 0.371408 0.17113
C  -4.211541 1.225279 0.490527
C  4.962803 -0.004301 -0.648355
C  -2.358829 0.448644 -1.134215
C  2.40339 0.055042 -0.585628
C  -5.678338 1.034617 0.931169
C  6.274028 0.308772 0.104063
C  -1.323659 -0.03346 -0.134594
C  1.155225 0.380234 0.209502
H  -3.95471 -0.782486 -0.31337
H  -4.489902 0.417396 -1.514167
H  3.713475 -0.170214 1.136124
H  3.735406 1.449018 0.424451
H  -3.54181 1.062708 1.355801
H  -4.057463 2.272023 0.156245
H  4.951095 0.540736 -1.614515
H  4.929374 -1.084501 -0.898928
H  -2.174672 -0.100921 -2.079196
H  -2.142894 1.510607 -1.362295
H  2.350942 0.599898 -1.548184
H  2.353112 -1.020349 -0.85338
H  -6.375312 1.20908 0.089312
H  -5.94777 1.733697 1.74361
H  -5.848039 0.006288 1.301703
H  6.348969 1.387205 0.338476
H  6.323822 -0.245685 1.059758
H  7.159856 0.030459 -0.495442
