program: Orca
programVersion: 5.0.2
elementType: O O O C C C C C C C C C C C C C C C C C C C C C C C H H H H H H H H H H H H H H H H H H H H H H H H H H
charge: 0
multiplicity: 1
keywords: wb97x-d3
keywords: def2-TZVPP
keywords: def2/J RIJCOSX
keywords: DEFGRID2
keywords: scfconv7
keywords: smallprint printgap noloewdin
keywords: NOSOSCF
formula: C23H26O3
InChI: InChI=1/C23H26O3/c1-16(2)13-20-21(23(20,3)4)22(24)25-15-17-9-8-12-19(14-17)26-18-10-6-5-7-11-18/h5-14,20-21H,15H2,1-4H3
52 atoms
O  0.753303 -2.644411 -1.102974
O  0.248639 -2.296663 1.046522
O  2.60619 1.993068 -0.498938
C  -2.702707 -2.041272 0.034229
C  -2.08585 -0.680587 -0.008067
C  -1.370844 -1.843745 -0.666971
C  -3.869555 -2.329414 -0.878042
C  -2.791191 -2.7653 1.354672
C  -2.6036 0.418509 -0.86242
C  -0.079162 -2.283427 -0.117888
C  -3.560709 1.271809 -0.4912
C  -3.998705 2.390183 -1.384841
C  -4.248521 1.204556 0.836528
C  2.110246 -2.902868 -0.766649
C  2.87116 -1.655521 -0.401551
C  2.361556 -0.385957 -0.633709
C  4.138829 -1.78899 0.160054
C  3.103001 0.7307 -0.270383
C  4.880887 -0.665933 0.48541
C  4.363148 0.607729 0.285658
C  1.385245 2.322902 0.036298
C  0.608821 3.2273 -0.676564
C  0.949667 1.82597 1.259074
C  -0.602859 3.650961 -0.150469
C  -0.2685 2.255089 1.769156
C  -1.047944 3.168442 1.07318
H  -1.642225 -0.36611 0.933934
H  -1.421413 -1.864351 -1.749917
H  -3.769842 -1.848558 -1.85061
H  -4.79874 -1.974917 -0.426995
H  -3.971377 -3.403084 -1.045328
H  -2.64825 -3.840091 1.229061
H  -3.786431 -2.617526 1.778345
H  -2.072147 -2.410828 2.089102
H  -2.151603 0.538136 -1.842805
H  -3.443842 2.408994 -2.32246
H  -3.86512 3.357782 -0.893325
H  -5.06285 2.309804 -1.621001
H  -3.961964 0.334686 1.425834
H  -5.333236 1.180772 0.709271
H  -4.029362 2.097426 1.428476
H  2.53859 -3.354509 -1.661266
H  2.182935 -3.640694 0.034932
H  1.392895 -0.24012 -1.095751
H  4.545198 -2.776248 0.343012
H  5.865484 -0.77873 0.918482
H  4.929257 1.488163 0.559859
H  0.95538 3.600852 -1.631688
H  1.551228 1.122863 1.820965
H  -1.206252 4.355559 -0.707918
H  -0.604376 1.870859 2.723432
H  -1.995876 3.496712 1.478376
elementType: O C H
totalener: -1117.85511118 hartree
nucrepener: 2374.64252740 hartree
electener: -3492.49763858 hartree
oneelecener: -6239.54087750 hartree
twoeener: 2747.04323891 hartree
cpcmener: -0.03143689 hartree
kineticenergy: 1112.81271343 hartree
xcener: -110.233570272694 hartree
chargesum: -0.0000000
charge: -0.300290 -0.488127 -0.346814 0.139568 -0.061783 -0.042146 -0.282129 -0.303196 -0.230329 0.367387 -0.055960 -0.241566 -0.253510 0.092418 0.016525 -0.184626 -0.226945 0.231435 -0.127942 -0.226230 0.276157 -0.226844 -0.164852 -0.160812 -0.193424 -0.148729 0.105722 0.094044 0.093086 0.097926 0.102867 0.106456 0.095634 0.091523 0.123293 0.094949 0.089284 0.108201 0.092967 0.106678 0.099009 0.130238 0.119266 0.151402 0.146607 0.161510 0.149778 0.146612 0.153437 0.158365 0.160572 0.163338
qa: -0.3003 -0.4881 -0.3468 0.1396 -0.0618 -0.0421 -0.2821 -0.3032 -0.2303 0.3674 -0.0560 -0.2416 -0.2535 0.0924 0.0165 -0.1846 -0.2269 0.2314 -0.1279 -0.2262 0.2762 -0.2268 -0.1649 -0.1608 -0.1934 -0.1487 0.1057 0.0940 0.0931 0.0979 0.1029 0.1065 0.0956 0.0915 0.1233 0.0949 0.0893 0.1082 0.0930 0.1067 0.0990 0.1302 0.1193 0.1514 0.1466 0.1615 0.1498 0.1466 0.1534 0.1584 0.1606 0.1633
va: 2.1104 2.0007 2.0525 3.7521 3.7887 3.8334 3.9107 3.8905 3.7692 4.1572 3.6959 3.9220 3.9223 3.7947 3.6344 3.9330 3.9688 3.7489 3.8788 4.0029 3.6821 3.9941 3.8155 3.8735 3.8716 3.8060 1.0222 1.0348 1.0019 0.9995 1.0031 0.9989 1.0005 1.0192 1.0075 1.0058 0.9947 0.9990 1.0057 0.9997 1.0019 0.9919 1.0102 1.0074 0.9991 0.9875 1.0037 1.0076 1.0010 0.9902 0.9930 0.9841
dispcorr: -0.030306602 hartree
energy: -1117.885417785741
dipole: -29.51589 28.67000 -0.84589 -0.70694 0.41673 -0.29021 1.16509 -1.69272 -0.52762
magnitude: 1.03834 au
magnitude: 2.63924 debye
