program: Orca
programVersion: 5.0.2
elementType: O O O C C C C C C C C C C C C C C C C C C C C C C C H H H H H H H H H H H H H H H H H H H H H H H H H H
charge: 0
multiplicity: 1
keywords: wb97x-d3
keywords: def2-TZVPP
keywords: def2/J RIJCOSX
keywords: DEFGRID2
keywords: scfconv7
keywords: smallprint printgap noloewdin
keywords: NOSOSCF
formula: C23H26O3
InChI: InChI=1/C23H26O3/c1-16(2)13-20-21(23(20,3)4)22(24)25-15-17-9-8-12-19(14-17)26-18-10-6-5-7-11-18/h5-14,20-21H,15H2,1-4H3
52 atoms
O  0.659826 -2.082927 -1.484716
O  0.159619 -2.800438 0.570541
O  2.690057 2.206475 0.502712
C  -2.800991 -2.57162 -0.439797
C  -2.434169 -1.359264 0.354066
C  -1.538019 -1.807583 -0.796922
C  -3.91335 -2.491915 -1.45836
C  -2.725474 -3.922049 0.230431
C  -3.163251 -0.081187 0.268925
C  -0.186959 -2.293363 -0.472879
C  -3.250586 0.842316 1.233652
C  -4.071751 2.080471 1.033467
C  -2.580385 0.750723 2.571657
C  2.044702 -2.353938 -1.24509
C  2.635302 -1.393282 -0.249978
C  2.377749 -0.031108 -0.376093
C  3.431495 -1.855621 0.788823
C  2.8902 0.854428 0.560841
C  3.968898 -0.954904 1.699003
C  3.693659 0.398348 1.600036
C  1.60966 2.736207 -0.160727
C  1.853624 3.82149 -0.989596
C  0.316093 2.263614 0.030311
C  0.792763 4.442051 -1.634387
C  -0.731839 2.882361 -0.635555
C  -0.501507 3.971009 -1.466994
H  -2.017298 -1.591452 1.327697
H  -1.600144 -1.224724 -1.70886
H  -4.885648 -2.574309 -0.968973
H  -3.832282 -3.315427 -2.169899
H  -3.904751 -1.566083 -2.031625
H  -2.463857 -4.700882 -0.488276
H  -3.702476 -4.174919 0.645801
H  -2.007116 -3.95908 1.045405
H  -3.684803 0.116416 -0.662597
H  -4.543042 2.109032 0.051341
H  -3.461247 2.980111 1.145321
H  -4.860431 2.149289 1.787824
H  -1.821022 -0.026495 2.631958
H  -3.31246 0.560372 3.361507
H  -2.100344 1.700081 2.81982
H  2.517059 -2.241431 -2.220504
H  2.189207 -3.386513 -0.922562
H  1.772918 0.328247 -1.199268
H  3.624683 -2.915863 0.892347
H  4.591098 -1.311898 2.509055
H  4.095823 1.099702 2.320051
H  2.866446 4.180059 -1.122869
H  0.119297 1.423491 0.68554
H  0.984932 5.290342 -2.277959
H  -1.737178 2.506795 -0.498463
H  -1.32655 4.447787 -1.978991
elementType: O C H
totalener: -1117.85629193 hartree
nucrepener: 2331.74534874 hartree
electener: -3449.60164067 hartree
oneelecener: -6153.25840733 hartree
twoeener: 2703.65676666 hartree
cpcmener: -0.02971387 hartree
kineticenergy: 1112.79654539 hartree
xcener: -110.230069537594 hartree
chargesum: -0.0000000
charge: -0.298595 -0.499189 -0.337623 0.100379 0.050737 -0.077173 -0.282879 -0.276144 -0.287454 0.404803 -0.061392 -0.230256 -0.274182 0.106151 0.024837 -0.267649 -0.236891 0.323438 -0.102274 -0.277869 0.316092 -0.262941 -0.246216 -0.106473 -0.095494 -0.228329 0.098326 0.092172 0.100816 0.097727 0.091905 0.099099 0.096701 0.091058 0.120755 0.094648 0.090022 0.106392 0.093637 0.113071 0.094031 0.124684 0.115649 0.141709 0.145046 0.161215 0.147922 0.147749 0.164333 0.160890 0.175472 0.157556
qa: -0.2986 -0.4992 -0.3376 0.1004 0.0507 -0.0772 -0.2829 -0.2761 -0.2875 0.4048 -0.0614 -0.2303 -0.2742 0.1062 0.0248 -0.2676 -0.2369 0.3234 -0.1023 -0.2779 0.3161 -0.2629 -0.2462 -0.1065 -0.0955 -0.2283 0.0983 0.0922 0.1008 0.0977 0.0919 0.0991 0.0967 0.0911 0.1208 0.0946 0.0900 0.1064 0.0936 0.1131 0.0940 0.1247 0.1156 0.1417 0.1450 0.1612 0.1479 0.1477 0.1643 0.1609 0.1755 0.1576
va: 2.1092 2.0005 2.0772 3.7526 3.7418 3.7881 3.9135 3.8969 3.8568 4.1448 3.7320 3.9048 3.9301 3.7894 3.6383 3.9275 3.9607 3.6881 3.8797 4.0080 3.6948 4.0192 3.9568 3.8629 3.7868 3.9781 1.0242 1.0344 1.0000 1.0016 1.0064 0.9996 0.9995 1.0201 1.0112 1.0064 0.9976 0.9964 1.0093 0.9968 0.9972 0.9934 1.0087 1.0163 1.0031 0.9873 1.0074 1.0072 0.9881 0.9874 0.9789 0.9946
dispcorr: -0.027196363 hartree
energy: -1117.883488289476
dipole: -26.68442 25.83735 -0.84707 -3.89839 4.16997 0.27158 2.66047 -3.59466 -0.93419
magnitude: 1.28996 au
magnitude: 3.27882 debye
