program: Orca
programVersion: 5.0.2
elementType: O O O C C C C C C C C C C C C C C C C C C C C C C C H H H H H H H H H H H H H H H H H H H H H H H H H H
charge: 0
multiplicity: 1
keywords: wb97x-d3
keywords: def2-TZVPP
keywords: def2/J RIJCOSX
keywords: DEFGRID2
keywords: scfconv7
keywords: smallprint printgap noloewdin
keywords: NOSOSCF
formula: C23H26O3
InChI: InChI=1/C23H26O3/c1-16(2)13-20-21(23(20,3)4)22(24)25-15-17-9-8-12-19(14-17)26-18-10-6-5-7-11-18/h5-14,20-21H,15H2,1-4H3
52 atoms
O  -0.634414 -0.922486 -1.781009
O  -1.499086 0.131606 -0.010714
O  3.572185 2.046559 1.319575
C  -2.595371 -2.786765 0.491386
C  -3.708658 -1.876874 0.066769
C  -2.450954 -1.9338 -0.761866
C  -2.739029 -4.269771 0.260403
C  -1.817012 -2.450967 1.739088
C  -4.972535 -2.399171 -0.508726
C  -1.513918 -0.799613 -0.783273
C  -6.131425 -2.497413 0.148585
C  -7.362253 -3.027572 -0.521448
C  -6.309992 -2.103119 1.582339
C  0.408552 0.0485 -1.858169
C  1.407053 -0.087729 -0.741728
C  2.003002 1.057656 -0.230397
C  1.771768 -1.337027 -0.246359
C  2.980084 0.948556 0.751622
C  2.726942 -1.42839 0.754555
C  3.345806 -0.291449 1.252793
C  3.907366 3.132793 0.55102
C  4.410323 3.008246 -0.738711
C  3.782993 4.381184 1.144877
C  4.775373 4.151476 -1.435697
C  4.164397 5.514066 0.439983
C  4.655632 5.406643 -0.854005
H  -3.805173 -0.983175 0.676274
H  -2.510067 -2.487257 -1.693089
H  -3.324481 -4.723058 1.063138
H  -1.760406 -4.753103 0.251404
H  -3.233195 -4.502574 -0.682234
H  -1.840309 -1.392296 1.988461
H  -0.771878 -2.755137 1.646727
H  -2.241529 -2.991511 2.587391
H  -4.93868 -2.728049 -1.54356
H  -7.738861 -3.912706 -0.00244
H  -7.181315 -3.297208 -1.56181
H  -8.169265 -2.290631 -0.498502
H  -7.054742 -1.308519 1.676922
H  -5.391253 -1.760191 2.055331
H  -6.687152 -2.94749 2.164991
H  -0.001967 1.059535 -1.893866
H  0.889939 -0.143242 -2.817505
H  1.698801 2.029843 -0.600381
H  1.316571 -2.240039 -0.631934
H  3.006022 -2.398528 1.143857
H  4.099186 -0.363939 2.026666
H  4.522376 2.036199 -1.201713
H  3.394671 4.463579 2.152139
H  5.16359 4.054065 -2.441087
H  4.068027 6.485722 0.906513
H  4.94549 6.292224 -1.403448
elementType: O C H
totalener: -1117.85587712 hartree
nucrepener: 2175.04538779 hartree
electener: -3292.90126491 hartree
oneelecener: -5840.02342469 hartree
twoeener: 2547.12215978 hartree
cpcmener: -0.03167055 hartree
kineticenergy: 1112.79946837 hartree
xcener: -110.227790692638 hartree
chargesum: 0.0000000
charge: -0.296333 -0.490108 -0.340056 0.156673 -0.009050 -0.112694 -0.270385 -0.297766 -0.275580 0.400607 -0.031977 -0.229506 -0.251509 0.103522 0.051477 -0.218897 -0.279777 0.287041 -0.103953 -0.261085 0.299177 -0.198735 -0.259578 -0.147670 -0.121402 -0.194223 0.099412 0.093193 0.096963 0.098908 0.091982 0.095294 0.096530 0.100639 0.123819 0.094733 0.089664 0.094991 0.099053 0.087809 0.096411 0.117643 0.123751 0.144100 0.145374 0.160882 0.149060 0.157474 0.148212 0.162937 0.161361 0.161594
qa: -0.2963 -0.4901 -0.3401 0.1567 -0.0091 -0.1127 -0.2704 -0.2978 -0.2756 0.4006 -0.0320 -0.2295 -0.2515 0.1035 0.0515 -0.2189 -0.2798 0.2870 -0.1040 -0.2611 0.2992 -0.1987 -0.2596 -0.1477 -0.1214 -0.1942 0.0994 0.0932 0.0970 0.0989 0.0920 0.0953 0.0965 0.1006 0.1238 0.0947 0.0897 0.0950 0.0991 0.0878 0.0964 0.1176 0.1238 0.1441 0.1454 0.1609 0.1491 0.1575 0.1482 0.1629 0.1614 0.1616
va: 2.1132 2.0093 2.0634 3.6521 3.7984 3.8649 3.9064 3.8953 3.8725 4.1814 3.7013 3.9260 3.9423 3.7861 3.5861 3.9670 3.9430 3.6937 3.8763 4.0227 3.6739 3.9033 4.0054 3.8875 3.8770 3.9024 1.0239 1.0379 1.0024 1.0028 1.0020 1.0164 1.0019 1.0022 1.0067 0.9961 1.0075 0.9951 0.9978 1.0080 0.9974 1.0111 0.9921 1.0068 1.0119 0.9877 1.0056 0.9970 1.0079 0.9891 0.9879 0.9894
dispcorr: -0.024082127 hartree
energy: -1117.879959242440
dipole: -31.31580 31.13563 -0.18016 -20.39283 19.44131 -0.95152 3.02170 -3.96580 -0.94410
magnitude: 1.35247 au
magnitude: 3.43770 debye
