program: Orca
programVersion: 5.0.2
elementType: O O O C C C C C C C C C C C C C C C C C C C C C C C H H H H H H H H H H H H H H H H H H H H H H H H H H
charge: 0
multiplicity: 1
keywords: wb97x-d3
keywords: def2-TZVPP
keywords: def2/J RIJCOSX
keywords: DEFGRID2
keywords: scfconv7
keywords: smallprint printgap noloewdin
keywords: NOSOSCF
formula: C23H26O3
InChI: InChI=1/C23H26O3/c1-16(2)13-20-21(23(20,3)4)22(24)25-15-17-9-8-12-19(14-17)26-18-10-6-5-7-11-18/h5-14,20-21H,15H2,1-4H3
52 atoms
O  0.670623 -2.261582 -1.360896
O  0.15407 -2.567193 0.790365
O  3.002586 2.132127 -0.070655
C  -2.793496 -2.53305 -0.322792
C  -2.463246 -1.188835 0.247802
C  -1.520378 -1.826519 -0.757656
C  -3.865877 -2.650028 -1.378484
C  -2.736947 -3.73314 0.58988
C  -3.169882 0.048195 -0.140912
C  -0.180148 -2.257747 -0.330829
C  -3.688368 0.960998 0.68728
C  -4.339022 2.199135 0.148044
C  -3.666601 0.87034 2.182152
C  2.03589 -2.581824 -1.09004
C  2.729671 -1.517956 -0.285336
C  2.504195 -0.172436 -0.553556
C  3.633286 -1.880513 0.707104
C  3.170318 0.793731 0.18711
C  4.312277 -0.904144 1.420995
C  4.077308 0.440194 1.174763
C  1.736741 2.647689 -0.18918
C  1.575593 3.718395 -1.058488
C  0.665566 2.177139 0.561358
C  0.331554 4.321538 -1.176496
C  -0.573127 2.788506 0.428277
C  -0.750213 3.857159 -0.439955
H  -2.105708 -1.225536 1.271466
H  -1.556182 -1.414887 -1.760284
H  -3.862363 -1.817235 -2.080245
H  -4.853144 -2.69177 -0.914256
H  -3.733163 -3.56736 -1.95465
H  -2.438454 -4.629352 0.042695
H  -3.729676 -3.918488 1.004284
H  -2.056097 -3.605174 1.427967
H  -3.254994 0.231198 -1.20824
H  -5.376386 2.279425 0.483727
H  -4.332703 2.227484 -0.941337
H  -3.82909 3.095796 0.512169
H  -3.188183 1.753735 2.613635
H  -3.150966 -0.00817 2.564336
H  -4.686004 0.851288 2.576524
H  2.493529 -2.673266 -2.075027
H  2.116311 -3.553038 -0.598045
H  1.813703 0.125981 -1.333666
H  3.803888 -2.92779 0.923157
H  5.014632 -1.189588 2.192782
H  4.590395 1.206584 1.741287
H  2.419348 4.07763 -1.634174
H  0.785741 1.350811 1.25044
H  0.209905 5.155201 -1.855735
H  -1.40294 2.426778 1.020678
H  -1.720604 4.326086 -0.535999
elementType: O C H
totalener: -1117.85705338 hartree
nucrepener: 2321.54839069 hartree
electener: -3439.40544407 hartree
oneelecener: -6132.99687283 hartree
twoeener: 2693.59142876 hartree
cpcmener: -0.03136953 hartree
kineticenergy: 1112.80203740 hartree
xcener: -110.230182800550 hartree
chargesum: 0.0000000
charge: -0.298395 -0.497964 -0.344656 0.105115 0.060253 -0.093597 -0.267088 -0.279896 -0.284801 0.410225 -0.080456 -0.229723 -0.252245 0.108492 0.023401 -0.219787 -0.215799 0.250415 -0.122028 -0.241678 0.308948 -0.266860 -0.210529 -0.108416 -0.135804 -0.226000 0.096904 0.089197 0.089475 0.097625 0.097983 0.100549 0.096368 0.091193 0.121724 0.106728 0.094681 0.086427 0.092653 0.090886 0.106023 0.123623 0.117237 0.145140 0.145728 0.160914 0.149258 0.147966 0.150282 0.160673 0.192600 0.157033
qa: -0.2984 -0.4980 -0.3447 0.1051 0.0603 -0.0936 -0.2671 -0.2799 -0.2848 0.4102 -0.0805 -0.2297 -0.2522 0.1085 0.0234 -0.2198 -0.2158 0.2504 -0.1220 -0.2417 0.3089 -0.2669 -0.2105 -0.1084 -0.1358 -0.2260 0.0969 0.0892 0.0895 0.0976 0.0980 0.1005 0.0964 0.0912 0.1217 0.1067 0.0947 0.0864 0.0927 0.0909 0.1060 0.1236 0.1172 0.1451 0.1457 0.1609 0.1493 0.1480 0.1503 0.1607 0.1926 0.1570
va: 2.1128 1.9986 2.0578 3.7203 3.7219 3.8417 3.9085 3.9012 3.8237 4.1230 3.7717 3.9096 3.9341 3.7850 3.6129 3.9372 3.9542 3.7231 3.8893 4.0128 3.6620 4.0147 3.9157 3.8976 3.8236 3.9330 1.0286 1.0386 1.0052 1.0018 1.0023 0.9993 1.0002 1.0194 1.0110 0.9988 1.0067 0.9940 0.9973 1.0098 0.9969 0.9927 1.0089 1.0151 1.0019 0.9880 1.0045 1.0077 1.0077 0.9882 0.9546 0.9933
dispcorr: -0.027045576 hartree
energy: -1117.884098959924
dipole: -29.51937 28.62103 -0.89834 -3.59736 3.48806 -0.10930 2.56643 -3.27519 -0.70875
magnitude: 1.14948 au
magnitude: 2.92174 debye
