program: Orca
programVersion: 5.0.2
elementType: O O O C C C C C C C C C C C C C C C C C C C C C C C H H H H H H H H H H H H H H H H H H H H H H H H H H
charge: 0
multiplicity: 1
keywords: wb97x-d3
keywords: def2-TZVPP
keywords: def2/J RIJCOSX
keywords: DEFGRID2
keywords: scfconv7
keywords: smallprint printgap noloewdin
keywords: NOSOSCF
formula: C23H26O3
InChI: InChI=1/C23H26O3/c1-16(2)13-20-21(23(20,3)4)22(24)25-15-17-9-8-12-19(14-17)26-18-10-6-5-7-11-18/h5-14,20-21H,15H2,1-4H3
52 atoms
O  -0.118425 -1.223463 1.545669
O  -0.239247 -2.355371 -0.377828
O  3.69174 1.839978 -0.1471
C  -2.370756 -0.149415 -1.094976
C  -3.063673 -1.390557 -0.655709
C  -1.966882 -0.806246 0.218867
C  -3.074567 1.178103 -0.946713
C  -1.458751 -0.202801 -2.29561
C  -4.466716 -1.398987 -0.167299
C  -0.706497 -1.542352 0.388907
C  -4.941368 -2.235228 0.75967
C  -6.374795 -2.195097 1.191324
C  -4.098542 -3.263951 1.448321
C  1.128975 -1.852234 1.848635
C  2.25245 -1.338903 0.992948
C  2.41481 0.030443 0.810821
C  3.153099 -2.224379 0.413253
C  3.46525 0.499634 0.035419
C  4.216516 -1.740548 -0.335546
C  4.373823 -0.378664 -0.539075
C  2.635604 2.694527 -0.343336
C  1.539842 2.352808 -1.127131
C  2.732008 3.955018 0.229027
C  0.5319 3.285665 -1.324644
C  1.721497 4.881531 0.01294
C  0.615177 4.550921 -0.757685
H  -2.754204 -2.286655 -1.18875
H  -2.299793 -0.279706 1.105828
H  -2.346437 1.990001 -0.894627
H  -3.690796 1.229854 -0.04934
H  -3.719314 1.3690 -1.8069
H  -0.634244 0.505637 -2.194161
H  -2.020066 0.07563 -3.189418
H  -1.036921 -1.189073 -2.473464
H  -5.148919 -0.684137 -0.619001
H  -6.865866 -3.154424 1.009748
H  -6.940381 -1.421997 0.671775
H  -6.453042 -2.008473 2.265431
H  -3.079108 -3.312593 1.06993
H  -4.541912 -4.257064 1.342556
H  -4.048376 -3.063574 2.52184
H  1.044734 -2.937776 1.770579
H  1.307486 -1.609838 2.896119
H  1.726508 0.726899 1.27479
H  3.023959 -3.290962 0.547451
H  4.920295 -2.430177 -0.782439
H  5.193138 0.001645 -1.135572
H  1.466663 1.374045 -1.584604
H  3.593074 4.208952 0.834161
H  -0.321807 3.017991 -1.934111
H  1.800525 5.865037 0.457264
H  -0.173822 5.273209 -0.918288
elementType: O C H
totalener: -1117.85549567 hartree
nucrepener: 2288.81907302 hartree
electener: -3406.67456869 hartree
oneelecener: -6067.30939178 hartree
twoeener: 2660.63482309 hartree
cpcmener: -0.03040313 hartree
kineticenergy: 1112.80115183 hartree
xcener: -110.228171937220 hartree
chargesum: -0.0000000
charge: -0.298583 -0.502179 -0.343169 0.163887 -0.027190 -0.096383 -0.291778 -0.275644 -0.302918 0.409004 -0.009122 -0.229438 -0.245399 0.105560 0.031587 -0.238478 -0.224559 0.275254 -0.117298 -0.256119 0.292897 -0.192794 -0.258723 -0.146830 -0.117222 -0.205536 0.104522 0.092821 0.093849 0.094862 0.101042 0.081477 0.102028 0.095824 0.125697 0.096357 0.090111 0.095115 0.081234 0.101453 0.100221 0.116725 0.124780 0.142379 0.145531 0.161551 0.149923 0.164597 0.148015 0.169448 0.161136 0.160469
qa: -0.2986 -0.5022 -0.3432 0.1639 -0.0272 -0.0964 -0.2918 -0.2756 -0.3029 0.4090 -0.0091 -0.2294 -0.2454 0.1056 0.0316 -0.2385 -0.2246 0.2753 -0.1173 -0.2561 0.2929 -0.1928 -0.2587 -0.1468 -0.1172 -0.2055 0.1045 0.0928 0.0938 0.0949 0.1010 0.0815 0.1020 0.0958 0.1257 0.0964 0.0901 0.0951 0.0812 0.1015 0.1002 0.1167 0.1248 0.1424 0.1455 0.1616 0.1499 0.1646 0.1480 0.1694 0.1611 0.1605
va: 2.1042 1.9956 2.0633 3.6692 3.8290 3.8015 3.9155 3.8817 3.8912 4.1162 3.6998 3.9302 3.9389 3.7893 3.6129 3.9294 3.9568 3.7046 3.8886 4.0129 3.7093 3.8864 4.0093 3.8681 3.8787 3.9378 1.0251 1.0329 1.0071 1.0024 0.9990 1.0053 1.0020 1.0208 1.0030 0.9961 1.0061 0.9962 1.0144 0.9993 0.9980 1.0092 0.9926 1.0163 1.0032 0.9878 1.0051 0.9906 1.0074 0.9825 0.9872 0.9912
dispcorr: -0.026505549 hartree
energy: -1117.882001214962
dipole: -29.98282 28.94743 -1.03539 -5.81270 6.20326 0.39056 -0.95780 1.72188 0.76408
magnitude: 1.34476 au
magnitude: 3.41812 debye
