program: Orca
programVersion: 5.0.2
elementType: O O O C C C C C C C C C C C C C C C C C C C C C C C H H H H H H H H H H H H H H H H H H H H H H H H H H
charge: 0
multiplicity: 1
keywords: wb97x-d3
keywords: def2-TZVPP
keywords: def2/J RIJCOSX
keywords: DEFGRID2
keywords: scfconv7
keywords: smallprint printgap noloewdin
keywords: NOSOSCF
formula: C23H26O3
InChI: InChI=1/C23H26O3/c1-16(2)13-20-21(23(20,3)4)22(24)25-15-17-9-8-12-19(14-17)26-18-10-6-5-7-11-18/h5-14,20-21H,15H2,1-4H3
52 atoms
O  0.21911 -1.097377 1.882896
O  -0.246661 -2.635634 0.329288
O  3.634799 1.740045 -0.854687
C  -2.260712 -0.376312 -0.565397
C  -2.997148 -1.509563 0.084793
C  -1.815448 -0.887718 0.796306
C  -2.881582 0.998511 -0.581711
C  -1.436455 -0.663799 -1.79622
C  -4.341839 -1.353725 0.678642
C  -0.562611 -1.645734 0.950395
C  -5.413081 -2.100478 0.394329
C  -6.716385 -1.879014 1.100073
C  -5.416717 -3.21867 -0.60602
C  1.536836 -1.638184 2.04053
C  2.420007 -1.261906 0.884337
C  2.587047 0.083282 0.565543
C  3.065841 -2.237489 0.136541
C  3.387326 0.438375 -0.510229
C  3.884079 -1.867766 -0.92261
C  4.040374 -0.533571 -1.25907
C  2.688845 2.716097 -0.663389
C  3.140487 3.944493 -0.201888
C  1.349062 2.525672 -0.979597
C  2.243334 4.99365 -0.060041
C  0.461722 3.580672 -0.82187
C  0.90073 4.815906 -0.363705
H  -2.789097 -2.479729 -0.353897
H  -2.043992 -0.225617 1.624482
H  -3.581816 1.087711 -1.414493
H  -2.1133 1.762794 -0.713455
H  -3.422609 1.230857 0.334561
H  -0.568166 -0.003446 -1.849307
H  -2.038309 -0.482147 -2.688244
H  -1.082308 -1.690371 -1.849325
H  -4.450106 -0.569877 1.422939
H  -6.650236 -1.094727 1.853769
H  -7.052245 -2.794445 1.594438
H  -7.50351 -1.605274 0.393042
H  -6.36061 -3.239856 -1.153947
H  -5.325698 -4.188589 -0.109168
H  -4.613864 -3.147501 -1.338163
H  1.501606 -2.720424 2.173518
H  1.903173 -1.199948 2.967864
H  2.097407 0.843988 1.162001
H  2.93088 -3.283348 0.381351
H  4.391087 -2.625828 -1.50471
H  4.667357 -0.242084 -2.092041
H  4.188014 4.078306 0.036888
H  0.995097 1.571411 -1.34967
H  2.598944 5.951525 0.296216
H  -0.582143 3.433728 -1.067335
H  0.201845 5.633397 -0.248181
elementType: O C H
totalener: -1117.85619328 hartree
nucrepener: 2267.00123191 hartree
electener: -3384.85742519 hartree
oneelecener: -6023.56727977 hartree
twoeener: 2638.70985458 hartree
cpcmener: -0.03128718 hartree
kineticenergy: 1112.80146724 hartree
xcener: -110.228089029987 hartree
chargesum: 0.0000000
charge: -0.292053 -0.494353 -0.338712 0.119052 0.039779 -0.103244 -0.263084 -0.278095 -0.310089 0.403144 -0.021874 -0.222496 -0.271680 0.094938 0.021256 -0.250767 -0.222022 0.303064 -0.112834 -0.264848 0.273226 -0.233453 -0.205355 -0.133082 -0.177346 -0.179331 0.093012 0.091641 0.098350 0.086441 0.090902 0.091013 0.100891 0.095005 0.122310 0.088284 0.095407 0.094169 0.094375 0.104501 0.095322 0.116378 0.126988 0.141514 0.145767 0.161078 0.148857 0.147301 0.190387 0.160318 0.179196 0.160855
qa: -0.2921 -0.4944 -0.3387 0.1191 0.0398 -0.1032 -0.2631 -0.2781 -0.3101 0.4031 -0.0219 -0.2225 -0.2717 0.0949 0.0213 -0.2508 -0.2220 0.3031 -0.1128 -0.2648 0.2732 -0.2335 -0.2054 -0.1331 -0.1773 -0.1793 0.0930 0.0916 0.0984 0.0864 0.0909 0.0910 0.1009 0.0950 0.1223 0.0883 0.0954 0.0942 0.0944 0.1045 0.0953 0.1164 0.1270 0.1415 0.1458 0.1611 0.1489 0.1473 0.1904 0.1603 0.1792 0.1609
va: 2.1137 2.0070 2.0711 3.6715 3.7822 3.8577 3.9086 3.8930 3.8972 4.1779 3.7129 3.9254 3.9452 3.7978 3.6199 3.9417 3.9461 3.6871 3.8919 4.0086 3.7320 3.9876 3.9154 3.8896 3.9029 3.9140 1.0306 1.0377 1.0030 1.0106 1.0055 1.0029 1.0018 1.0189 1.0088 1.0090 0.9940 0.9961 0.9990 0.9945 1.0035 1.0083 0.9944 1.0148 1.0054 0.9878 1.0065 1.0077 0.9610 0.9883 0.9800 0.9905
dispcorr: -0.025647330 hartree
energy: -1117.881840606639
dipole: -32.29972 31.47163 -0.82810 -5.46086 6.22263 0.76177 -3.10004 3.57198 0.47194
magnitude: 1.22015 au
magnitude: 3.10138 debye
