program: Orca
programVersion: 5.0.2
elementType: O O O C C C C C C C C C C C C C C C C C C C C C C C H H H H H H H H H H H H H H H H H H H H H H H H H H
charge: 0
multiplicity: 1
keywords: wb97x-d3
keywords: def2-TZVPP
keywords: def2/J RIJCOSX
keywords: DEFGRID2
keywords: scfconv7
keywords: smallprint printgap noloewdin
keywords: NOSOSCF
formula: C23H26O3
InChI: InChI=1/C23H26O3/c1-16(2)13-20-21(23(20,3)4)22(24)25-15-17-9-8-12-19(14-17)26-18-10-6-5-7-11-18/h5-14,20-21H,15H2,1-4H3
52 atoms
O  0.12851 -2.038861 -1.694015
O  -0.623254 -0.060013 -0.973603
O  3.923334 1.813782 0.60566
C  -2.327861 -2.060609 0.80795
C  -3.194151 -1.346286 -0.185651
C  -1.945072 -2.033513 -0.666621
C  -2.783477 -3.394496 1.342534
C  -1.549445 -1.250174 1.814177
C  -4.517851 -1.879749 -0.597938
C  -0.779129 -1.252305 -1.112595
C  -5.679118 -1.544474 -0.030038
C  -6.97782 -2.114612 -0.511112
C  -5.7872 -0.590892 1.119131
C  1.385403 -1.452481 -2.049814
C  2.179422 -1.078235 -0.829759
C  2.681732 0.208574 -0.700365
C  2.402414 -2.013104 0.178678
C  3.385247 0.562485 0.443831
C  3.118753 -1.651542 1.308554
C  3.60663 -0.359824 1.453957
C  3.197884 2.931592 0.28142
C  3.927513 4.046955 -0.109623
C  1.812749 2.993103 0.38425
C  3.26549 5.230483 -0.400191
C  1.164434 4.181992 0.07847
C  1.881698 5.303746 -0.314172
H  -3.122356 -0.2632 -0.13631
H  -2.077395 -2.978582 -1.18319
H  -1.934995 -3.966872 1.72209
H  -3.281793 -4.001152 0.587238
H  -3.482984 -3.252625 2.169258
H  -1.344311 -0.234313 1.482378
H  -0.596221 -1.727374 2.052478
H  -2.119892 -1.177498 2.742059
H  -4.528715 -2.593878 -1.416489
H  -7.658673 -1.323122 -0.834726
H  -7.489605 -2.651599 0.291579
H  -6.841359 -2.802967 -1.344884
H  -6.391302 0.278668 0.84744
H  -4.822161 -0.231483 1.472775
H  -6.295382 -1.065214 1.962441
H  1.239837 -0.592625 -2.706069
H  1.893649 -2.22721 -2.62275
H  2.508124 0.932479 -1.487671
H  2.019388 -3.021526 0.085172
H  3.292686 -2.376453 2.092618
H  4.155464 -0.072155 2.341488
H  5.006014 3.986987 -0.183203
H  1.234305 2.132872 0.696498
H  3.838421 6.096653 -0.704351
H  0.086109 4.227496 0.156958
H  1.367371 6.225998 -0.548677
elementType: O C H
totalener: -1117.85509885 hartree
nucrepener: 2235.55875169 hartree
electener: -3353.41385054 hartree
oneelecener: -5961.23359228 hartree
twoeener: 2607.81974174 hartree
cpcmener: -0.02943977 hartree
kineticenergy: 1112.80746146 hartree
xcener: -110.228221086373 hartree
chargesum: 0.0000000
charge: -0.290039 -0.492753 -0.340566 0.133770 -0.013082 -0.104752 -0.278235 -0.294053 -0.261601 0.404584 -0.039284 -0.230305 -0.248561 0.097755 0.051297 -0.231745 -0.279008 0.299059 -0.103229 -0.254330 0.308258 -0.262455 -0.199226 -0.121157 -0.155674 -0.195147 0.099641 0.095337 0.101339 0.093314 0.098145 0.091713 0.099158 0.101182 0.123322 0.095127 0.094464 0.090082 0.102212 0.086789 0.096337 0.117276 0.126872 0.146574 0.142378 0.161082 0.149432 0.146971 0.157233 0.161192 0.162115 0.161191
qa: -0.2900 -0.4928 -0.3406 0.1338 -0.0131 -0.1048 -0.2782 -0.2941 -0.2616 0.4046 -0.0393 -0.2303 -0.2486 0.0978 0.0513 -0.2317 -0.2790 0.2991 -0.1032 -0.2543 0.3083 -0.2625 -0.1992 -0.1212 -0.1557 -0.1951 0.0996 0.0953 0.1013 0.0933 0.0981 0.0917 0.0992 0.1012 0.1233 0.0951 0.0945 0.0901 0.1022 0.0868 0.0963 0.1173 0.1269 0.1466 0.1424 0.1611 0.1494 0.1470 0.1572 0.1612 0.1621 0.1612
va: 2.1139 2.0072 2.0663 3.6683 3.8089 3.8342 3.9042 3.9005 3.8563 4.1966 3.7059 3.9273 3.9363 3.7892 3.5725 3.9445 3.9486 3.6811 3.8620 4.0237 3.6731 4.0010 3.8882 3.8784 3.8973 3.9041 1.0241 1.0354 1.0027 1.0019 1.0006 1.0141 1.0010 1.0023 1.0062 0.9953 0.9963 1.0072 0.9985 1.0081 0.9978 1.0094 0.9928 1.0062 1.0116 0.9875 1.0052 1.0087 0.9984 0.9878 0.9900 0.9894
dispcorr: -0.025239071 hartree
energy: -1117.880337924103
dipole: -33.16757 32.39914 -0.76844 -11.89308 10.77948 -1.11361 7.38060 -7.28544 0.09515
magnitude: 1.35634 au
magnitude: 3.44755 debye
