program: Orca
programVersion: 5.0.2
elementType: O O O C C C C C C C C C C C C C C C C C C C C C C C H H H H H H H H H H H H H H H H H H H H H H H H H H
charge: 0
multiplicity: 1
keywords: wb97x-d3
keywords: def2-TZVPP
keywords: def2/J RIJCOSX
keywords: DEFGRID2
keywords: scfconv7
keywords: smallprint printgap noloewdin
keywords: NOSOSCF
formula: C23H26O3
InChI: InChI=1/C23H26O3/c1-16(2)13-20-21(23(20,3)4)22(24)25-15-17-9-8-12-19(14-17)26-18-10-6-5-7-11-18/h5-14,20-21H,15H2,1-4H3
52 atoms
O  0.177218 -1.431672 1.624927
O  -0.224321 -2.39068 -0.353038
O  3.765282 1.838298 -0.229289
C  -2.369952 -0.075247 -0.529531
C  -3.04489 -1.366697 -0.178807
C  -1.84037 -0.910787 0.623586
C  -3.014819 1.232806 -0.140628
C  -1.615588 0.006304 -1.833672
C  -4.363682 -1.434971 0.480857
C  -0.573514 -1.656573 0.543685
C  -5.375788 -2.208336 0.076704
C  -6.674888 -2.238547 0.821696
C  -5.287882 -3.106682 -1.129136
C  1.459774 -2.060072 1.685765
C  2.443756 -1.448676 0.72881
C  2.605397 -0.067556 0.688491
C  3.220206 -2.259348 -0.090078
C  3.533879 0.487454 -0.180404
C  4.162792 -1.692644 -0.936649
C  4.31887 -0.316839 -0.995291
C  2.712212 2.71581 -0.16219
C  1.51491 2.484401 -0.828248
C  2.910841 3.887072 0.554821
C  0.509191 3.437748 -0.761892
C  1.900121 4.837029 0.602298
C  0.694695 4.615435 -0.049304
H  -2.83311 -2.173521 -0.873404
H  -2.051576 -0.502682 1.605756
H  -3.773052 1.516861 -0.872755
H  -2.268597 2.029611 -0.113146
H  -3.492175 1.197475 0.837567
H  -2.270195 0.417752 -2.604349
H  -1.264378 -0.959653 -2.188929
H  -0.75383 0.671543 -1.749191
H  -4.5035 -0.815301 1.361491
H  -6.667757 -1.582941 1.692295
H  -6.905344 -3.251234 1.163324
H  -7.504061 -1.937068 0.176498
H  -6.265124 -3.514295 -1.387171
H  -4.624594 -3.956967 -0.954095
H  -4.91087 -2.583918 -2.009206
H  1.372547 -3.135078 1.518774
H  1.786484 -1.910725 2.714458
H  2.014301 0.56961 1.335836
H  3.089259 -3.33382 -0.063701
H  4.768784 -2.325068 -1.57186
H  5.042476 0.132358 -1.663439
H  1.363832 1.575242 -1.396688
H  3.850433 4.054188 1.066188
H  -0.424234 3.257655 -1.279812
H  2.05705 5.75121 1.159707
H  -0.093296 5.355265 -0.005147
elementType: O C H
totalener: -1117.85568166 hartree
nucrepener: 2268.82971004 hartree
electener: -3386.68539170 hartree
oneelecener: -6027.32688684 hartree
twoeener: 2640.64149514 hartree
cpcmener: -0.03116368 hartree
kineticenergy: 1112.79819480 hartree
xcener: -110.227216161433 hartree
chargesum: 0.0000000
charge: -0.294768 -0.496432 -0.343899 0.119722 0.045001 -0.112340 -0.272415 -0.271318 -0.314048 0.415755 -0.011904 -0.221470 -0.284445 0.104188 0.026398 -0.230836 -0.221316 0.271197 -0.116809 -0.253346 0.289206 -0.190775 -0.255172 -0.152731 -0.118935 -0.202577 0.093855 0.090345 0.098747 0.093295 0.090274 0.101842 0.094157 0.079410 0.121734 0.085665 0.098533 0.095817 0.096027 0.104574 0.103187 0.116658 0.125669 0.141153 0.145584 0.160229 0.149769 0.167927 0.148238 0.169562 0.161188 0.160632
qa: -0.2948 -0.4964 -0.3439 0.1197 0.0450 -0.1123 -0.2724 -0.2713 -0.3140 0.4158 -0.0119 -0.2215 -0.2844 0.1042 0.0264 -0.2308 -0.2213 0.2712 -0.1168 -0.2533 0.2892 -0.1908 -0.2552 -0.1527 -0.1189 -0.2026 0.0939 0.0903 0.0987 0.0933 0.0903 0.1018 0.0942 0.0794 0.1217 0.0857 0.0985 0.0958 0.0960 0.1046 0.1032 0.1167 0.1257 0.1412 0.1456 0.1602 0.1498 0.1679 0.1482 0.1696 0.1612 0.1606
va: 2.1136 2.0052 2.0608 3.6614 3.7715 3.8652 3.9167 3.9000 3.8979 4.1488 3.6947 3.9207 3.9410 3.7892 3.6158 3.9285 3.9504 3.7058 3.8912 4.0113 3.7050 3.8839 4.0093 3.8756 3.8815 3.9343 1.0278 1.0377 1.0011 1.0058 1.0068 1.0012 1.0213 1.0061 1.0092 1.0099 0.9925 0.9935 1.0042 0.9958 0.9960 1.0089 0.9930 1.0162 1.0034 0.9883 1.0053 0.9889 1.0073 0.9825 0.9873 0.9910
dispcorr: -0.025693292 hartree
energy: -1117.881374955214
dipole: -32.87387 31.93626 -0.93760 -4.94518 5.35567 0.41049 -3.86176 4.47847 0.61671
magnitude: 1.19496 au
magnitude: 3.03735 debye
