program: Orca
programVersion: 5.0.2
elementType: O O O C C C C C C C C C C C C C C C C C C C C C C C H H H H H H H H H H H H H H H H H H H H H H H H H H
charge: 0
multiplicity: 1
keywords: wb97x-d3
keywords: def2-TZVPP
keywords: def2/J RIJCOSX
keywords: DEFGRID2
keywords: scfconv7
keywords: smallprint printgap noloewdin
keywords: NOSOSCF
formula: C23H26O3
InChI: InChI=1/C23H26O3/c1-16(2)13-20-21(23(20,3)4)22(24)25-15-17-9-8-12-19(14-17)26-18-10-6-5-7-11-18/h5-14,20-21H,15H2,1-4H3
52 atoms
O  0.653101 -2.763374 -0.030448
O  -0.132645 -1.269628 1.440736
O  3.018977 2.18901 0.087312
C  -2.92473 -2.269155 0.437971
C  -2.561352 -1.007851 -0.280694
C  -1.572953 -2.166185 -0.245355
C  -3.901957 -3.231991 -0.193044
C  -3.032745 -2.232589 1.942711
C  -3.142339 -0.613508 -1.578186
C  -0.309316 -2.001135 0.492193
C  -3.525048 0.617602 -1.932805
C  -4.058872 0.889861 -3.306948
C  -3.451024 1.823595 -1.045369
C  2.001916 -2.60254 0.447035
C  2.645601 -1.444984 -0.259896
C  2.605096 -0.175585 0.302998
C  3.212419 -1.62163 -1.519112
C  3.070593 0.915318 -0.41788
C  3.721845 -0.531311 -2.208522
C  3.637763 0.745676 -1.67234
C  1.94002 2.558618 0.855726
C  0.638426 2.203467 0.518374
C  2.194515 3.345203 1.969507
C  -0.407647 2.629927 1.322758
C  1.135145 3.778808 2.755365
C  -0.167126 3.416436 2.442118
H  -2.291466 -0.190315 0.379674
H  -1.48303 -2.739099 -1.161363
H  -4.92728 -2.901737 -0.017332
H  -3.794531 -4.224531 0.247883
H  -3.764801 -3.335514 -1.268266
H  -2.443039 -1.441608 2.397502
H  -2.723831 -3.182872 2.381947
H  -4.073044 -2.065566 2.226569
H  -3.24146 -1.403383 -2.317062
H  -5.085177 1.263177 -3.26142
H  -4.048871 0.002194 -3.938844
H  -3.471967 1.665787 -3.805487
H  -4.371333 2.406075 -1.11717
H  -2.641693 2.487557 -1.35908
H  -3.2974 1.585254 0.004439
H  2.498036 -3.53852 0.197646
H  2.021312 -2.483898 1.530249
H  2.193924 -0.03984 1.294362
H  3.255489 -2.610452 -1.958526
H  4.170998 -0.669475 -3.183165
H  4.008621 1.602198 -2.220788
H  0.434721 1.598942 -0.356683
H  3.213041 3.615459 2.218084
H  -1.41982 2.347491 1.064987
H  1.335288 4.393697 3.623009
H  -0.989845 3.74582 3.06238
elementType: O C H
totalener: -1117.85518598 hartree
nucrepener: 2312.82026322 hartree
electener: -3430.67544919 hartree
oneelecener: -6115.76229538 hartree
twoeener: 2685.08684618 hartree
cpcmener: -0.02997975 hartree
kineticenergy: 1112.81111398 hartree
xcener: -110.229606683222 hartree
chargesum: -0.0000000
charge: -0.292220 -0.503690 -0.343550 0.097370 0.054940 -0.071359 -0.272430 -0.279027 -0.284096 0.408597 -0.036700 -0.221421 -0.284622 0.086427 -0.015367 -0.174428 -0.235837 0.274849 -0.114103 -0.255165 0.327067 -0.247851 -0.265269 -0.109659 -0.105654 -0.232125 0.081313 0.088369 0.097567 0.097951 0.089483 0.091052 0.100255 0.095846 0.122276 0.094259 0.088856 0.093698 0.100655 0.102713 0.100552 0.125494 0.116552 0.145165 0.147062 0.161736 0.149263 0.158008 0.147288 0.179601 0.161136 0.159175
qa: -0.2922 -0.5037 -0.3436 0.0974 0.0549 -0.0714 -0.2724 -0.2790 -0.2841 0.4086 -0.0367 -0.2214 -0.2846 0.0864 -0.0154 -0.1744 -0.2358 0.2748 -0.1141 -0.2552 0.3271 -0.2479 -0.2653 -0.1097 -0.1057 -0.2321 0.0813 0.0884 0.0976 0.0980 0.0895 0.0911 0.1003 0.0958 0.1223 0.0943 0.0889 0.0937 0.1007 0.1027 0.1006 0.1255 0.1166 0.1452 0.1471 0.1617 0.1493 0.1580 0.1473 0.1796 0.1611 0.1592
va: 2.1240 1.9850 2.0675 3.7086 3.7681 3.8258 3.9123 3.8982 3.8782 4.1383 3.7232 3.9243 3.9438 3.7959 3.6565 3.8635 3.9813 3.7279 3.8781 4.0224 3.6545 3.8968 4.0197 3.8012 3.8643 3.9746 1.0195 1.0363 1.0014 1.0014 1.0059 1.0198 0.9991 1.0000 1.0095 0.9962 1.0089 0.9953 0.9996 0.9942 1.0016 0.9953 1.0135 1.0224 1.0019 0.9870 1.0052 0.9972 1.0078 0.9762 0.9873 0.9931
dispcorr: -0.026278274 hartree
energy: -1117.881464252619
dipole: -28.86037 28.15913 -0.70124 -4.07425 3.36857 -0.70568 -5.29728 4.55041 -0.74688
magnitude: 1.24400 au
magnitude: 3.16201 debye
