program: Orca
programVersion: 5.0.2
elementType: O O O C C C C C C C C C C C C C C C C C C C C C C C H H H H H H H H H H H H H H H H H H H H H H H H H H
charge: 0
multiplicity: 1
keywords: wb97x-d3
keywords: def2-TZVPP
keywords: def2/J RIJCOSX
keywords: DEFGRID2
keywords: scfconv7
keywords: smallprint printgap noloewdin
keywords: NOSOSCF
formula: C23H26O3
InChI: InChI=1/C23H26O3/c1-16(2)13-20-21(23(20,3)4)22(24)25-15-17-9-8-12-19(14-17)26-18-10-6-5-7-11-18/h5-14,20-21H,15H2,1-4H3
52 atoms
O  0.749434 -2.220371 -1.206809
O  0.091277 -2.637514 0.891406
O  2.738859 1.991176 0.776737
C  -2.783946 -2.144231 -0.352649
C  -2.304318 -0.912278 0.346392
C  -1.403838 -1.586195 -0.664604
C  -3.802793 -1.993011 -1.454892
C  -2.946298 -3.415997 0.439945
C  -2.830029 0.443541 0.04234
C  -0.148936 -2.209889 -0.214495
C  -3.846591 1.025475 0.683745
C  -4.290275 2.414648 0.343548
C  -4.61924 0.357775 1.778689
C  2.081273 -2.620646 -0.918846
C  2.902212 -1.517927 -0.302089
C  2.38443 -0.25003 -0.069628
C  4.23055 -1.789634 0.012637
C  3.197062 0.736761 0.47797
C  5.02979 -0.795515 0.554115
C  4.523459 0.474185 0.788245
C  1.595072 2.468061 0.177099
C  1.514702 2.602334 -1.202653
C  0.548965 2.865387 0.994946
C  0.364802 3.138224 -1.763426
C  -0.592597 3.409962 0.421583
C  -0.690549 3.543839 -0.956106
H  -2.014523 -1.07856 1.380572
H  -1.32878 -1.092846 -1.627567
H  -3.784689 -2.858913 -2.119101
H  -3.631392 -1.104588 -2.061815
H  -4.808005 -1.918218 -1.034502
H  -2.768629 -4.29406 -0.183879
H  -3.970752 -3.482294 0.811499
H  -2.285151 -3.474162 1.301681
H  -2.336397 0.993657 -0.753568
H  -5.342838 2.428674 0.049531
H  -3.70681 2.845999 -0.469749
H  -4.204236 3.075825 1.209725
H  -4.290376 -0.661063 1.977812
H  -5.682098 0.321332 1.526883
H  -4.545105 0.924476 2.710258
H  2.508389 -2.899063 -1.882301
H  2.100662 -3.512093 -0.288744
H  1.357003 -0.017028 -0.314522
H  4.63919 -2.775931 -0.170369
H  6.063644 -1.006672 0.793255
H  5.14784 1.25101 1.210358
H  2.339461 2.294228 -1.833086
H  0.628408 2.755449 2.068847
H  0.29763 3.242975 -2.83818
H  -1.410545 3.722709 1.057474
H  -1.584481 3.962171 -1.399291
elementType: O C H
totalener: -1117.85536910 hartree
nucrepener: 2329.25714217 hartree
electener: -3447.11251127 hartree
oneelecener: -6148.38391304 hartree
twoeener: 2701.27140177 hartree
cpcmener: -0.03120450 hartree
kineticenergy: 1112.79955768 hartree
xcener: -110.230581647871 hartree
chargesum: -0.0000000
charge: -0.298264 -0.490691 -0.338470 0.132285 0.009111 -0.106965 -0.271856 -0.296122 -0.290349 0.398368 -0.026592 -0.257223 -0.255070 0.090096 0.010225 -0.202835 -0.265406 0.307932 -0.105471 -0.269666 0.278112 -0.194133 -0.228617 -0.126460 -0.130177 -0.210636 0.102617 0.092292 0.101028 0.093099 0.098716 0.103313 0.096894 0.091733 0.137408 0.106205 0.090451 0.098864 0.087324 0.097578 0.102603 0.132692 0.118106 0.134831 0.145657 0.159370 0.147312 0.157969 0.147893 0.162568 0.168223 0.164128
qa: -0.2983 -0.4907 -0.3385 0.1323 0.0091 -0.1070 -0.2719 -0.2961 -0.2903 0.3984 -0.0266 -0.2572 -0.2551 0.0901 0.0102 -0.2028 -0.2654 0.3079 -0.1055 -0.2697 0.2781 -0.1941 -0.2286 -0.1265 -0.1302 -0.2106 0.1026 0.0923 0.1010 0.0931 0.0987 0.1033 0.0969 0.0917 0.1374 0.1062 0.0905 0.0989 0.0873 0.0976 0.1026 0.1327 0.1181 0.1348 0.1457 0.1594 0.1473 0.1580 0.1479 0.1626 0.1682 0.1641
va: 2.1141 2.0050 2.0687 3.7241 3.7811 3.8464 3.8988 3.8933 3.8521 4.1577 3.6461 3.9366 3.9433 3.8051 3.6749 3.8888 3.9917 3.7051 3.8840 3.9974 3.6736 3.9346 3.9933 3.8660 3.8046 3.8524 1.0238 1.0385 1.0033 1.0023 1.0005 0.9999 1.0001 1.0185 0.9901 1.0007 1.0052 0.9930 1.0074 0.9972 0.9989 0.9909 1.0127 1.0193 0.9992 0.9876 1.0082 0.9959 1.0058 0.9883 0.9815 0.9907
dispcorr: -0.027822442 hartree
energy: -1117.883191540547
dipole: -30.66406 29.71026 -0.95380 -2.44504 2.63080 0.18576 -0.56857 -0.69833 -1.26690
magnitude: 1.59664 au
magnitude: 4.05834 debye
