program: Orca
programVersion: 5.0.2
elementType: O O O C C C C C C C C C C C C C C C C C C C C C C C H H H H H H H H H H H H H H H H H H H H H H H H H H
charge: 0
multiplicity: 1
keywords: wb97x-d3
keywords: def2-TZVPP
keywords: def2/J RIJCOSX
keywords: DEFGRID2
keywords: scfconv7
keywords: smallprint printgap noloewdin
keywords: NOSOSCF
formula: C23H26O3
InChI: InChI=1/C23H26O3/c1-16(2)13-20-21(23(20,3)4)22(24)25-15-17-9-8-12-19(14-17)26-18-10-6-5-7-11-18/h5-14,20-21H,15H2,1-4H3
52 atoms
O  0.697914 -2.412403 -0.638754
O  -0.200379 -2.368022 1.412151
O  2.86051 2.04698 0.52649
C  -2.879999 -2.363962 -0.25333
C  -2.582064 -0.991558 0.271301
C  -1.511885 -1.749035 -0.493384
C  -3.75131 -2.520916 -1.476199
C  -3.052211 -3.490242 0.736084
C  -3.166825 0.229114 -0.317003
C  -0.305444 -2.207696 0.219858
C  -3.743162 1.23488 0.349959
C  -4.323738 2.407778 -0.382123
C  -3.875694 1.310911 1.840481
C  1.984298 -2.767703 -0.141285
C  2.89737 -1.574407 -0.051582
C  2.407607 -0.296478 0.189252
C  4.268519 -1.76901 -0.189866
C  3.287502 0.775853 0.269467
C  5.137731 -0.694339 -0.081911
C  4.655533 0.586848 0.137669
C  1.634308 2.463719 0.080385
C  0.831246 3.159939 0.971404
C  1.224338 2.254266 -1.231378
C  -0.393096 3.654715 0.542958
C  -0.006483 2.743573 -1.642087
C  -0.818446 3.446122 -0.761224
H  -2.410545 -0.960835 1.341775
H  -1.332265 -1.427088 -1.513461
H  -3.566495 -1.761078 -2.234438
H  -4.807122 -2.465921 -1.202248
H  -3.582454 -3.493893 -1.941954
H  -4.109689 -3.59752 0.986271
H  -2.514004 -3.330435 1.667707
H  -2.719241 -4.440071 0.311891
H  -3.125894 0.303592 -1.39999
H  -3.915255 3.350601 -0.008986
H  -5.405609 2.463185 -0.23065
H  -4.139626 2.359913 -1.455461
H  -4.915744 1.491114 2.124916
H  -3.300406 2.154584 2.232771
H  -3.544696 0.414949 2.362002
H  2.389476 -3.492195 -0.848076
H  1.90624 -3.265983 0.827078
H  1.347527 -0.117681 0.314325
H  4.657199 -2.760764 -0.38731
H  6.203217 -0.850432 -0.19088
H  5.330062 1.43115 0.203578
H  1.164887 3.316484 1.989696
H  1.856224 1.719049 -1.92936
H  -1.018483 4.200041 1.238367
H  -0.327366 2.581038 -2.662984
H  -1.772894 3.832833 -1.092073
elementType: O C H
totalener: -1117.86967354 hartree
nucrepener: 2319.52091550 hartree
electener: -3437.39058904 hartree
oneelecener: -6128.71909615 hartree
twoeener: 2691.32850711 hartree
cpcmener: -0.02618936 hartree
kineticenergy: 1112.79618639 hartree
xcener: -110.228780653286 hartree
chargesum: -0.0000000
charge: -0.284508 -0.466170 -0.328343 0.099003 0.076617 -0.107055 -0.265959 -0.276981 -0.297346 0.378215 -0.049166 -0.243624 -0.248739 0.092513 0.032821 -0.213298 -0.244561 0.275713 -0.105256 -0.256397 0.268702 -0.223964 -0.179486 -0.130223 -0.151674 -0.188523 0.092742 0.086813 0.086763 0.097117 0.097492 0.095769 0.091771 0.097906 0.117206 0.086684 0.109501 0.095625 0.096425 0.093591 0.091260 0.119988 0.110298 0.151446 0.140785 0.156039 0.144789 0.145972 0.154655 0.155625 0.157605 0.163821
qa: -0.2845 -0.4662 -0.3283 0.0990 0.0766 -0.1071 -0.2660 -0.2770 -0.2973 0.3782 -0.0492 -0.2436 -0.2487 0.0925 0.0328 -0.2133 -0.2446 0.2757 -0.1053 -0.2564 0.2687 -0.2240 -0.1795 -0.1302 -0.1517 -0.1885 0.0927 0.0868 0.0868 0.0971 0.0975 0.0958 0.0918 0.0979 0.1172 0.0867 0.1095 0.0956 0.0964 0.0936 0.0913 0.1200 0.1103 0.1514 0.1408 0.1560 0.1448 0.1460 0.1547 0.1556 0.1576 0.1638
va: 2.1203 2.0356 2.0795 3.7287 3.7215 3.8396 3.9057 3.9064 3.8410 4.2172 3.7263 3.9209 3.9377 3.8346 3.6950 3.9236 3.9824 3.7576 3.8942 4.0116 3.7023 4.0082 3.9060 3.8574 3.8800 3.8648 1.0342 1.0377 1.0066 1.0020 1.0019 1.0002 1.0194 0.9996 1.0113 0.9940 0.9991 1.0052 0.9980 0.9986 1.0102 0.9948 1.0152 1.0002 1.0025 0.9891 1.0079 1.0067 0.9962 0.9914 0.9918 0.9845
dispcorr: -0.026770693 hartree
energy: -1117.896444235200
dipole: -29.42420 28.78749 -0.63671 -2.24457 2.09531 -0.14926 -1.54755 0.44610 -1.10145
magnitude: 1.28096 au
magnitude: 3.25594 debye
