program: Orca
programVersion: 5.0.2
elementType: O O O C C C C C C C C C C C C C C C C C C C C C C C H H H H H H H H H H H H H H H H H H H H H H H H H H
charge: 0
multiplicity: 1
keywords: wb97x-d3
keywords: def2-TZVPP
keywords: def2/J RIJCOSX
keywords: DEFGRID2
keywords: scfconv7
keywords: smallprint printgap noloewdin
keywords: NOSOSCF
formula: C23H26O3
InChI: InChI=1/C23H26O3/c1-16(2)13-20-21(23(20,3)4)22(24)25-15-17-9-8-12-19(14-17)26-18-10-6-5-7-11-18/h5-14,20-21H,15H2,1-4H3
52 atoms
O  0.705595 -2.265676 -1.107754
O  -0.048405 -2.555135 0.978497
O  2.673414 2.001045 0.824211
C  -2.857648 -2.369451 -0.422752
C  -2.512162 -1.046781 0.188483
C  -1.513136 -1.733708 -0.730773
C  -3.832405 -2.424096 -1.574723
C  -2.952924 -3.576583 0.478008
C  -3.134008 0.224038 -0.231863
C  -0.245025 -2.231477 -0.168138
C  -3.546866 1.18977 0.595359
C  -4.168249 2.445819 0.066723
C  -3.417924 1.110076 2.092339
C  2.021338 -2.654143 -0.737518
C  2.860465 -1.503515 -0.245973
C  2.321585 -0.256994 0.042717
C  4.227261 -1.715306 -0.083029
C  3.150854 0.767804 0.487273
C  5.040544 -0.688104 0.366813
C  4.51225 0.56249 0.65167
C  1.521285 2.477614 0.256206
C  1.353246 2.515854 -1.122701
C  0.545174 2.977878 1.104169
C  0.186752 3.051528 -1.648065
C  -0.611117 3.524561 0.564264
C  -0.79884 3.556667 -0.810022
H  -2.244658 -1.104659 1.238534
H  -1.429721 -1.319739 -1.729634
H  -3.715536 -3.358844 -2.127048
H  -3.702377 -1.609336 -2.286321
H  -4.860349 -2.38368 -1.207536
H  -3.989314 -3.710817 0.796237
H  -2.347114 -3.493661 1.37767
H  -2.653647 -4.485327 -0.048784
H  -3.254313 0.380181 -1.299701
H  -5.203979 2.540302 0.406026
H  -4.16875 2.482534 -1.022842
H  -3.646655 3.33291 0.436246
H  -2.399346 1.341724 2.416533
H  -3.663976 0.124061 2.487738
H  -4.07588 1.829201 2.581913
H  2.463678 -3.067844 -1.645021
H  1.999375 -3.4560 0.004562
H  1.264254 -0.062789 -0.076867
H  4.657246 -2.683197 -0.311908
H  6.102725 -0.855869 0.489654
H  5.148041 1.367699 0.997458
H  2.120977 2.134357 -1.784479
H  0.689782 2.944856 2.176633
H  0.05389 3.080826 -2.721785
H  -1.37115 3.919271 1.226347
H  -1.704244 3.978304 -1.22595
elementType: O C H
totalener: -1117.86882687 hartree
nucrepener: 2331.47346017 hartree
electener: -3449.34228704 hartree
oneelecener: -6152.68757525 hartree
twoeener: 2703.34528821 hartree
cpcmener: -0.02665405 hartree
kineticenergy: 1112.78868047 hartree
xcener: -110.227879562247 hartree
chargesum: 0.0000000
charge: -0.290075 -0.463614 -0.327172 0.105902 0.079391 -0.116913 -0.270130 -0.279409 -0.300111 0.377638 -0.032113 -0.239645 -0.282470 0.089116 0.022164 -0.209906 -0.255046 0.294814 -0.106543 -0.260273 0.274575 -0.187003 -0.224833 -0.143495 -0.137781 -0.179885 0.094162 0.087535 0.096941 0.087548 0.097892 0.095170 0.092307 0.097725 0.114231 0.109880 0.091363 0.089335 0.100823 0.105871 0.098100 0.128252 0.116039 0.141064 0.141452 0.155581 0.144672 0.155476 0.145660 0.158054 0.160863 0.156820
qa: -0.2901 -0.4636 -0.3272 0.1059 0.0794 -0.1169 -0.2701 -0.2794 -0.3001 0.3776 -0.0321 -0.2396 -0.2825 0.0891 0.0222 -0.2099 -0.2550 0.2948 -0.1065 -0.2603 0.2746 -0.1870 -0.2248 -0.1435 -0.1378 -0.1799 0.0942 0.0875 0.0969 0.0875 0.0979 0.0952 0.0923 0.0977 0.1142 0.1099 0.0914 0.0893 0.1008 0.1059 0.0981 0.1283 0.1160 0.1411 0.1415 0.1556 0.1447 0.1555 0.1457 0.1581 0.1609 0.1568
va: 2.1184 2.0372 2.0817 3.7219 3.7282 3.8554 3.9099 3.9048 3.8689 4.1882 3.6850 3.9131 3.9318 3.8280 3.6688 3.9119 3.9885 3.7353 3.8925 4.0034 3.7005 3.9232 4.0091 3.9023 3.8362 3.8585 1.0293 1.0367 1.0019 1.0067 1.0012 0.9998 1.0198 0.9999 1.0125 0.9977 1.0067 0.9935 0.9963 0.9996 1.0021 0.9915 1.0123 1.0059 1.0006 0.9891 1.0086 0.9960 1.0079 0.9905 0.9859 0.9901
dispcorr: -0.027291048 hartree
energy: -1117.896117919546
dipole: -28.09416 27.43779 -0.65637 -2.27026 2.29756 0.02729 -0.76643 -0.37746 -1.14390
magnitude: 1.31912 au
magnitude: 3.35292 debye
