program: Orca
programVersion: 5.0.2
elementType: O O O C C C C C C C C C C C C C C C C C C C C C C C H H H H H H H H H H H H H H H H H H H H H H H H H H
charge: 0
multiplicity: 1
keywords: wb97x-d3
keywords: def2-TZVPP
keywords: def2/J RIJCOSX
keywords: DEFGRID2
keywords: scfconv7
keywords: smallprint printgap noloewdin
keywords: NOSOSCF
formula: C23H26O3
InChI: InChI=1/C23H26O3/c1-16(2)13-20-21(23(20,3)4)22(24)25-15-17-9-8-12-19(14-17)26-18-10-6-5-7-11-18/h5-14,20-21H,15H2,1-4H3
52 atoms
O  0.436842 -2.826003 -1.184891
O  0.02481 -2.763878 1.008683
O  1.87518 1.975268 -0.904214
C  -2.973715 -3.096431 0.138829
C  -2.679421 -1.648184 0.315359
C  -1.766381 -2.498284 -0.562756
C  -4.093858 -3.515729 -0.783454
C  -2.802491 -4.023231 1.317616
C  -3.496905 -0.567782 -0.289235
C  -0.37772 -2.714814 -0.12922
C  -3.073301 0.68329 -0.491685
C  -3.974702 1.72566 -1.078804
C  -1.688503 1.150711 -0.165691
C  1.837064 -2.88267 -0.92543
C  2.376501 -1.581316 -0.397632
C  1.867084 -0.369168 -0.852068
C  3.408172 -1.582298 0.532403
C  2.390392 0.823035 -0.377451
C  3.937305 -0.381673 0.985803
C  3.437317 0.830093 0.536321
C  1.547238 3.033507 -0.106336
C  1.542631 4.282467 -0.716128
C  1.173078 2.899058 1.225766
C  1.15988 5.399337 0.010721
C  0.802619 4.02893 1.942666
C  0.792411 5.281042 1.344607
H  -2.228301 -1.402637 1.273524
H  -1.882421 -2.362866 -1.631956
H  -4.174838 -2.881162 -1.666038
H  -5.054277 -3.489176 -0.264338
H  -3.936782 -4.53882 -1.130632
H  -2.506173 -5.023367 0.994476
H  -3.753782 -4.119388 1.845394
H  -2.067067 -3.670589 2.03686
H  -4.517702 -0.816572 -0.565174
H  -4.966904 1.33362 -1.302642
H  -3.555333 2.132056 -2.003156
H  -4.092771 2.572142 -0.397029
H  -1.185265 1.514939 -1.065257
H  -1.063711 0.376971 0.278035
H  -1.720434 1.993776 0.529458
H  2.285598 -3.113313 -1.892593
H  2.077938 -3.704855 -0.24814
H  1.061518 -0.338853 -1.576308
H  3.799882 -2.520846 0.904986
H  4.746768 -0.387506 1.704337
H  3.857162 1.761568 0.894498
H  1.831879 4.373187 -1.75589
H  1.158814 1.930156 1.708162
H  1.154697 6.368752 -0.470996
H  0.512274 3.920792 2.979907
H  0.497777 6.15494 1.910473
elementType: O C H
totalener: -1117.86909652 hartree
nucrepener: 2304.37550482 hartree
electener: -3422.24460133 hartree
oneelecener: -6098.54829345 hartree
twoeener: 2676.30369212 hartree
cpcmener: -0.02419878 hartree
kineticenergy: 1112.80593686 hartree
xcener: -110.229294924138 hartree
chargesum: -0.0000000
charge: -0.293848 -0.465547 -0.327579 0.165746 -0.040946 -0.067288 -0.293688 -0.276368 -0.284257 0.356375 0.012533 -0.231102 -0.267609 0.099985 0.048379 -0.300574 -0.211510 0.284487 -0.124088 -0.212918 0.329459 -0.264479 -0.230653 -0.116641 -0.143212 -0.193034 0.103780 0.089682 0.090676 0.100320 0.098397 0.098003 0.093386 0.093174 0.122429 0.089370 0.094763 0.095707 0.097491 0.078799 0.102810 0.120167 0.114402 0.139656 0.139809 0.158261 0.155067 0.144291 0.154664 0.156586 0.158994 0.157693
qa: -0.2938 -0.4655 -0.3276 0.1657 -0.0409 -0.0673 -0.2937 -0.2764 -0.2843 0.3564 0.0125 -0.2311 -0.2676 0.1000 0.0484 -0.3006 -0.2115 0.2845 -0.1241 -0.2129 0.3295 -0.2645 -0.2307 -0.1166 -0.1432 -0.1930 0.1038 0.0897 0.0907 0.1003 0.0984 0.0980 0.0934 0.0932 0.1224 0.0894 0.0948 0.0957 0.0975 0.0788 0.1028 0.1202 0.1144 0.1397 0.1398 0.1583 0.1551 0.1443 0.1547 0.1566 0.1590 0.1577
va: 2.1083 2.0350 2.0466 3.7140 3.8284 3.7861 3.9148 3.8814 3.8941 4.1690 3.7489 3.9260 3.9492 3.7995 3.6265 4.0252 3.9762 3.7259 3.8890 3.9481 3.5848 4.0162 3.8576 3.8881 3.8949 3.9114 1.0233 1.0344 1.0011 0.9989 1.0027 0.9997 1.0010 1.0203 1.0027 1.0066 0.9965 0.9960 0.9979 1.0070 0.9978 0.9921 1.0096 1.0199 1.0034 0.9899 0.9967 1.0098 1.0016 0.9893 0.9897 0.9904
dispcorr: -0.027153794 hartree
energy: -1117.896250312167
dipole: -22.61117 22.43115 -0.18002 -3.85630 4.03241 0.17611 0.90063 -1.27388 -0.37325
magnitude: 0.45027 au
magnitude: 1.14449 debye
