program: Orca
programVersion: 5.0.2
elementType: O O O C C C C C C C C C C C C C C C C C C C C C C C H H H H H H H H H H H H H H H H H H H H H H H H H H
charge: 0
multiplicity: 1
keywords: wb97x-d3
keywords: def2-TZVPP
keywords: def2/J RIJCOSX
keywords: DEFGRID2
keywords: scfconv7
keywords: smallprint printgap noloewdin
keywords: NOSOSCF
formula: C23H26O3
InChI: InChI=1/C23H26O3/c1-16(2)13-20-21(23(20,3)4)22(24)25-15-17-9-8-12-19(14-17)26-18-10-6-5-7-11-18/h5-14,20-21H,15H2,1-4H3
52 atoms
O  0.329032 -2.535729 -1.166842
O  -0.198672 -2.700111 0.996797
O  1.61849 2.188047 -0.276309
C  -3.089092 -3.148502 -0.17308
C  -2.944227 -1.742518 0.319343
C  -1.911815 -2.300589 -0.631626
C  -4.129719 -3.438312 -1.226447
C  -2.885031 -4.288632 0.79265
C  -3.830287 -0.640752 -0.1378
C  -0.538434 -2.536173 -0.15035
C  -4.971258 -0.290134 0.460692
C  -5.802222 0.849916 -0.043796
C  -5.515744 -0.992936 1.665957
C  1.714636 -2.627928 -0.847505
C  2.236363 -1.377863 -0.192877
C  1.729264 -0.13195 -0.542055
C  3.263213 -1.462018 0.74039
C  2.228278 1.013903 0.060122
C  3.767118 -0.307629 1.321308
C  3.25144 0.938201 0.99723
C  2.326872 3.358416 -0.303474
C  1.737847 4.471518 0.278107
C  3.555747 3.457467 -0.944615
C  2.383307 5.698051 0.210909
C  4.194629 4.68758 -0.994608
C  3.614295 5.810752 -0.419892
H  -2.60116 -1.66697 1.347975
H  -1.971058 -1.959129 -1.659758
H  -3.884037 -4.350711 -1.773564
H  -4.227769 -2.632533 -1.953616
H  -5.108526 -3.58534 -0.76405
H  -3.849783 -4.602668 1.196275
H  -2.250606 -4.027713 1.636789
H  -2.444565 -5.154875 0.294344
H  -3.513448 -0.085494 -1.016335
H  -5.909221 1.626017 0.718855
H  -6.814567 0.51901 -0.290602
H  -5.373021 1.311927 -0.933062
H  -5.642197 -0.296376 2.499014
H  -4.885371 -1.811839 2.009361
H  -6.507108 -1.403601 1.456256
H  2.207783 -2.788839 -1.807034
H  1.915578 -3.502903 -0.225726
H  0.933867 -0.035981 -1.271722
H  3.662233 -2.428844 1.02169
H  4.560439 -0.376687 2.054365
H  3.636095 1.827824 1.47924
H  0.778521 4.37712 0.771582
H  4.008732 2.588926 -1.406523
H  1.920887 6.567255 0.660557
H  5.151607 4.766741 -1.494126
H  4.117148 6.767621 -0.467705
elementType: O C H
totalener: -1117.86927177 hartree
nucrepener: 2191.54204966 hartree
electener: -3309.41132143 hartree
oneelecener: -5873.09692968 hartree
twoeener: 2563.68560826 hartree
cpcmener: -0.02586413 hartree
kineticenergy: 1112.81266558 hartree
xcener: -110.228049357231 hartree
chargesum: -0.0000000
charge: -0.295305 -0.463417 -0.328233 0.118884 -0.019609 -0.084651 -0.273238 -0.295332 -0.245885 0.380181 -0.042992 -0.228808 -0.248765 0.106211 0.046037 -0.282524 -0.226289 0.274519 -0.130824 -0.201476 0.264601 -0.233956 -0.180624 -0.130093 -0.149691 -0.175813 0.102665 0.091138 0.100819 0.091645 0.096699 0.094410 0.094548 0.102575 0.120105 0.094831 0.092884 0.089193 0.101527 0.087119 0.096794 0.119920 0.113808 0.127732 0.140372 0.158138 0.153874 0.146536 0.156615 0.156518 0.158840 0.157791
qa: -0.2953 -0.4634 -0.3282 0.1189 -0.0196 -0.0847 -0.2732 -0.2953 -0.2459 0.3802 -0.0430 -0.2288 -0.2488 0.1062 0.0460 -0.2825 -0.2263 0.2745 -0.1308 -0.2015 0.2646 -0.2340 -0.1806 -0.1301 -0.1497 -0.1758 0.1027 0.0911 0.1008 0.0916 0.0967 0.0944 0.0945 0.1026 0.1201 0.0948 0.0929 0.0892 0.1015 0.0871 0.0968 0.1199 0.1138 0.1277 0.1404 0.1581 0.1539 0.1465 0.1566 0.1565 0.1588 0.1578
va: 2.1126 2.0421 2.0713 3.6932 3.8046 3.8361 3.9061 3.8962 3.8555 4.1929 3.7120 3.9289 3.9364 3.7911 3.6324 4.0550 3.9792 3.7507 3.9017 3.9181 3.7041 4.0025 3.9104 3.8911 3.8905 3.8956 1.0245 1.0354 1.0029 1.0026 1.0003 1.0005 1.0189 0.9994 1.0066 0.9957 0.9963 1.0074 0.9993 1.0084 0.9975 0.9918 1.0101 1.0329 1.0035 0.9907 0.9979 1.0074 0.9967 0.9898 0.9905 0.9904
dispcorr: -0.023611056 hartree
energy: -1117.892882820905
dipole: -30.09792 30.06821 -0.02971 -9.82210 9.97219 0.15010 2.09889 -2.73839 -0.63950
magnitude: 0.65755 au
magnitude: 1.67137 debye
