program: Orca
programVersion: 5.0.2
elementType: O O O C C C C C C C C C C C C C C C C C C C C C C C H H H H H H H H H H H H H H H H H H H H H H H H H H
charge: 0
multiplicity: 1
keywords: wb97x-d3
keywords: def2-TZVPP
keywords: def2/J RIJCOSX
keywords: DEFGRID2
keywords: scfconv7
keywords: smallprint printgap noloewdin
keywords: NOSOSCF
formula: C23H26O3
InChI: InChI=1/C23H26O3/c1-16(2)13-20-21(23(20,3)4)22(24)25-15-17-9-8-12-19(14-17)26-18-10-6-5-7-11-18/h5-14,20-21H,15H2,1-4H3
52 atoms
O  0.334755 -2.232621 -0.262615
O  -0.629488 -3.504439 -1.822714
O  2.686843 2.188264 -0.167073
C  -2.584794 -2.237299 0.907133
C  -2.115031 -0.907693 0.418251
C  -2.004355 -2.11193 -0.493495
C  -4.06667 -2.518525 0.964024
C  -1.805584 -2.932528 1.996223
C  -3.047519 0.200722 0.08325
C  -0.718534 -2.697335 -0.926335
C  -2.856851 1.081723 -0.9026
C  -3.824086 2.19605 -1.159218
C  -1.675895 1.043386 -1.820893
C  1.648138 -2.57482 -0.705822
C  2.571879 -1.472355 -0.275786
C  2.182436 -0.145553 -0.423782
C  3.832229 -1.764019 0.232774
C  3.036322 0.872556 -0.028454
C  4.692727 -0.734881 0.589385
C  4.297365 0.589252 0.475876
C  1.44934 2.613829 0.229644
C  0.759613 2.036904 1.291009
C  0.91646 3.702825 -0.447537
C  -0.474753 2.552909 1.658557
C  -0.313192 4.21569 -0.05903
C  -1.017887 3.641808 0.990363
H  -1.169883 -0.585038 0.84894
H  -2.745402 -2.178409 -1.283061
H  -4.615159 -2.039253 0.15271
H  -4.491814 -2.166415 1.906553
H  -4.256658 -3.591745 0.89961
H  -0.750712 -2.663996 2.006905
H  -1.875521 -4.017928 1.898398
H  -2.216267 -2.665383 2.972256
H  -3.924244 0.312514 0.715702
H  -3.324936 3.167698 -1.110073
H  -4.647167 2.202904 -0.444437
H  -4.250452 2.121247 -2.163364
H  -1.997611 0.957792 -2.862741
H  -0.994827 0.220594 -1.613326
H  -1.106643 1.974137 -1.750818
H  1.665192 -2.68131 -1.793042
H  1.949899 -3.531389 -0.273332
H  1.213673 0.099135 -0.842348
H  4.141947 -2.7947 0.354438
H  5.674646 -0.965284 0.981739
H  4.957134 1.393934 0.774729
H  1.17282 1.197766 1.835725
H  1.463224 4.145083 -1.271139
H  -1.010814 2.098238 2.481807
H  -0.724105 5.065301 -0.589335
H  -1.979953 4.03917 1.285728
elementType: O C H
totalener: -1117.86566680 hartree
nucrepener: 2369.32932451 hartree
electener: -3487.19499131 hartree
oneelecener: -6227.51578304 hartree
twoeener: 2740.32079173 hartree
cpcmener: -0.02516837 hartree
kineticenergy: 1112.80428008 hartree
xcener: -110.230494741068 hartree
chargesum: -0.0000000
charge: -0.281517 -0.469933 -0.328925 0.141295 0.038228 -0.125217 -0.292811 -0.276827 -0.307888 0.414958 -0.016121 -0.225647 -0.245401 0.050725 0.007220 -0.200694 -0.210263 0.263402 -0.112947 -0.245048 0.310920 -0.201632 -0.245264 -0.155725 -0.123146 -0.192946 0.090803 0.094414 0.092440 0.097360 0.098185 0.088688 0.100372 0.094757 0.119535 0.086404 0.091278 0.102920 0.114366 0.066692 0.094432 0.117769 0.115836 0.150095 0.141487 0.157405 0.146076 0.154472 0.143030 0.158108 0.154982 0.159297
qa: -0.2815 -0.4699 -0.3289 0.1413 0.0382 -0.1252 -0.2928 -0.2768 -0.3079 0.4150 -0.0161 -0.2256 -0.2454 0.0507 0.0072 -0.2007 -0.2103 0.2634 -0.1129 -0.2450 0.3109 -0.2016 -0.2453 -0.1557 -0.1231 -0.1929 0.0908 0.0944 0.0924 0.0974 0.0982 0.0887 0.1004 0.0948 0.1195 0.0864 0.0913 0.1029 0.1144 0.0667 0.0944 0.1178 0.1158 0.1501 0.1415 0.1574 0.1461 0.1545 0.1430 0.1581 0.1550 0.1593
va: 2.1014 2.0374 2.0837 3.7610 3.7220 3.8539 3.9105 3.8868 3.8165 4.1163 3.6998 3.9233 3.9302 3.8210 3.7417 3.9132 3.9546 3.7385 3.8875 4.0131 3.6595 3.8535 3.9609 3.8426 3.8506 3.8419 1.0160 1.0275 1.0019 0.9999 1.0028 1.0151 0.9999 1.0012 1.0068 0.9981 1.0061 0.9975 1.0053 1.0192 1.0046 1.0079 0.9995 0.9996 1.0034 0.9890 1.0063 0.9982 1.0100 0.9921 0.9910 0.9889
dispcorr: -0.030531441 hartree
energy: -1117.896198237061
dipole: -22.39001 22.21555 -0.17446 -0.75688 1.33833 0.58145 3.01360 -2.01880 0.99479
magnitude: 1.16539 au
magnitude: 2.96219 debye
