program: Orca
programVersion: 5.0.2
elementType: O O O C C C C C C C C C C C C C C C C C C C C C C C H H H H H H H H H H H H H H H H H H H H H H H H H H
charge: 0
multiplicity: 1
keywords: wb97x-d3
keywords: def2-TZVPP
keywords: def2/J RIJCOSX
keywords: DEFGRID2
keywords: scfconv7
keywords: smallprint printgap noloewdin
keywords: NOSOSCF
formula: C23H26O3
InChI: InChI=1/C23H26O3/c1-16(2)13-20-21(23(20,3)4)22(24)25-15-17-9-8-12-19(14-17)26-18-10-6-5-7-11-18/h5-14,20-21H,15H2,1-4H3
52 atoms
O  0.382052 -2.527647 -0.059355
O  -0.295915 -1.169921 -1.704502
O  3.166277 1.430824 1.35321
C  -2.181204 -0.165705 0.635066
C  -2.976154 -0.981441 -0.340269
C  -1.685281 -1.541054 0.215659
C  -2.655317 -0.04429 2.062733
C  -1.493224 1.080494 0.135613
C  -4.247425 -1.636159 0.036256
C  -0.494051 -1.698162 -0.637413
C  -5.431135 -1.488789 -0.56658
C  -6.637881 -2.228718 -0.071286
C  -5.684895 -0.603148 -1.747537
C  1.621956 -2.777658 -0.702361
C  2.673272 -1.748503 -0.379347
C  2.403164 -0.603419 0.35439
C  3.973106 -1.978279 -0.82984
C  3.422912 0.306431 0.611131
C  4.982908 -1.075842 -0.546751
C  4.714683 0.082926 0.171986
C  2.254515 2.335347 0.885394
C  2.018138 2.53089 -0.47063
C  1.587933 3.100483 1.834872
C  1.104129 3.497697 -0.867172
C  0.682144 4.065986 1.42187
C  0.431733 4.267961 0.070967
H  -2.908024 -0.631287 -1.365185
H  -1.787187 -2.30612 0.97801
H  -1.829617 0.247083 2.715104
H  -3.070476 -0.972082 2.454604
H  -3.427088 0.724264 2.144221
H  -0.579916 1.278455 0.701003
H  -2.153317 1.939596 0.271584
H  -1.234986 1.035282 -0.92005
H  -4.201082 -2.301936 0.893539
H  -7.433025 -1.535982 0.217665
H  -6.41199 -2.857828 0.789791
H  -7.056309 -2.867794 -0.853713
H  -4.802532 -0.071035 -2.098023
H  -6.443874 0.145529 -1.505051
H  -6.082359 -1.180419 -2.586437
H  1.494488 -2.861978 -1.784178
H  1.940694 -3.754977 -0.338674
H  1.415207 -0.40008 0.749015
H  4.195102 -2.874414 -1.397456
H  5.989865 -1.268007 -0.893613
H  5.497328 0.798828 0.388019
H  2.537511 1.945218 -1.218623
H  1.780335 2.939061 2.888379
H  0.921584 3.647511 -1.923694
H  0.164108 4.658657 2.165029
H  -0.279144 5.018996 -0.247287
elementType: O C H
totalener: -1117.87045915 hartree
nucrepener: 2291.55557438 hartree
electener: -3409.42603352 hartree
oneelecener: -6072.82618469 hartree
twoeener: 2663.40015117 hartree
cpcmener: -0.02574190 hartree
kineticenergy: 1112.79655311 hartree
xcener: -110.229176809946 hartree
chargesum: 0.0000000
charge: -0.288212 -0.455408 -0.332197 0.156173 0.035783 -0.109719 -0.270233 -0.285284 -0.279827 0.360215 -0.043977 -0.220568 -0.250887 0.079229 0.017071 -0.171644 -0.215954 0.209163 -0.130157 -0.209177 0.258334 -0.167294 -0.205964 -0.169186 -0.140227 -0.177898 0.093958 0.087875 0.097914 0.089020 0.097335 0.056095 0.104765 0.101406 0.116464 0.092601 0.087363 0.093565 0.089770 0.095068 0.095488 0.118314 0.128760 0.156795 0.142591 0.156940 0.146277 0.149558 0.142985 0.157049 0.154827 0.155062
qa: -0.2882 -0.4554 -0.3322 0.1562 0.0358 -0.1097 -0.2702 -0.2853 -0.2798 0.3602 -0.0440 -0.2206 -0.2509 0.0792 0.0171 -0.1716 -0.2160 0.2092 -0.1302 -0.2092 0.2583 -0.1673 -0.2060 -0.1692 -0.1402 -0.1779 0.0940 0.0879 0.0979 0.0890 0.0973 0.0561 0.1048 0.1014 0.1165 0.0926 0.0874 0.0936 0.0898 0.0951 0.0955 0.1183 0.1288 0.1568 0.1426 0.1569 0.1463 0.1496 0.1430 0.1570 0.1548 0.1551
va: 2.1173 2.0464 2.0671 3.6769 3.7946 3.8651 3.9036 3.8902 3.8757 4.2045 3.7489 3.9231 3.9423 3.8312 3.6649 3.9425 3.9641 3.8002 3.8816 3.9879 3.6972 3.8341 3.9424 3.8741 3.8895 3.8573 1.0305 1.0396 1.0010 1.0056 1.0025 1.0143 1.0025 1.0159 1.0103 0.9965 1.0091 0.9959 1.0097 0.9975 0.9969 1.0116 0.9916 0.9910 0.9998 0.9895 1.0043 1.0025 1.0087 0.9922 0.9904 0.9919
dispcorr: -0.026923379 hartree
energy: -1117.897382526757
dipole: -31.53091 31.02093 -0.50997 -1.07015 0.57778 -0.49237 -0.42287 0.70118 0.27832
magnitude: 0.76155 au
magnitude: 1.93571 debye
