program: Orca
programVersion: 5.0.2
elementType: O O O C C C C C C C C C C C C C C C C C C C C C C C H H H H H H H H H H H H H H H H H H H H H H H H H H
charge: 0
multiplicity: 1
keywords: wb97x-d3
keywords: def2-TZVPP
keywords: def2/J RIJCOSX
keywords: DEFGRID2
keywords: scfconv7
keywords: smallprint printgap noloewdin
keywords: NOSOSCF
formula: C23H26O3
InChI: InChI=1/C23H26O3/c1-16(2)13-20-21(23(20,3)4)22(24)25-15-17-9-8-12-19(14-17)26-18-10-6-5-7-11-18/h5-14,20-21H,15H2,1-4H3
52 atoms
O  0.40446 -2.12396 0.944279
O  -0.322461 -2.16158 -1.174042
O  3.396316 1.723973 -0.640831
C  -2.147754 0.13672 0.041428
C  -2.952895 -1.095351 -0.247648
C  -1.682734 -1.217172 0.557498
C  -2.63691 1.106745 1.087984
C  -1.417204 0.808915 -1.094154
C  -4.250701 -1.363443 0.413959
C  -0.495825 -1.879281 -0.013186
C  -5.444637 -1.381108 -0.186266
C  -6.694345 -1.674891 0.587548
C  -5.656895 -1.107063 -1.643366
C  1.634636 -2.746608 0.599418
C  2.736707 -1.762956 0.302934
C  2.493046 -0.429483 -0.002555
C  4.045851 -2.237168 0.321741
C  3.560671 0.417795 -0.283085
C  5.098411 -1.384983 0.030689
C  4.866249 -0.051361 -0.267438
C  2.29585 2.440253 -0.255046
C  1.652132 3.188188 -1.230201
C  1.874738 2.486769 1.068633
C  0.580738 3.996374 -0.875444
C  0.793157 3.287419 1.406352
C  0.142127 4.043998 0.439888
H  -2.8671 -1.446598 -1.271343
H  -1.800082 -1.351991 1.627682
H  -3.369367 1.793622 0.657993
H  -1.808828 1.706698 1.471312
H  -3.107348 0.612991 1.93813
H  -2.037115 1.607466 -1.507439
H  -1.176261 0.132267 -1.91163
H  -0.487072 1.265088 -0.748298
H  -4.216109 -1.558973 1.4822
H  -7.399606 -0.841429 0.527535
H  -6.492027 -1.868114 1.64114
H  -7.213434 -2.546609 0.179607
H  -4.735456 -0.918544 -2.191889
H  -6.301704 -0.233804 -1.776872
H  -6.169597 -1.942799 -2.127305
H  1.503704 -3.432366 -0.241257
H  1.908216 -3.349402 1.466589
H  1.4851 -0.0366 -0.025412
H  4.242103 -3.274157 0.567334
H  6.114654 -1.757023 0.048197
H  5.686977 0.619351 -0.488158
H  1.992584 3.142899 -2.257188
H  2.384996 1.913144 1.832618
H  0.082088 4.58188 -1.637205
H  0.464686 3.325538 2.437155
H  -0.699087 4.667513 0.712801
elementType: O C H
totalener: -1117.86947531 hartree
nucrepener: 2297.07673632 hartree
electener: -3414.94621162 hartree
oneelecener: -6083.60538087 hartree
twoeener: 2668.65916925 hartree
cpcmener: -0.02538352 hartree
kineticenergy: 1112.78800677 hartree
xcener: -110.228806475653 hartree
chargesum: 0.0000000
charge: -0.284335 -0.456789 -0.325553 0.181203 0.005183 -0.118744 -0.280576 -0.244388 -0.280587 0.364118 -0.032973 -0.225859 -0.252464 0.081421 0.009354 -0.201334 -0.238907 0.310508 -0.106601 -0.266741 0.286226 -0.218467 -0.189174 -0.128513 -0.150074 -0.184671 0.095483 0.088877 0.098488 0.094683 0.092706 0.105998 0.104521 0.009194 0.118532 0.093151 0.088332 0.094235 0.089113 0.095904 0.095419 0.114826 0.124266 0.133433 0.139245 0.155367 0.143551 0.143193 0.156477 0.155962 0.160149 0.157632
qa: -0.2843 -0.4568 -0.3256 0.1812 0.0052 -0.1187 -0.2806 -0.2444 -0.2806 0.3641 -0.0330 -0.2259 -0.2525 0.0814 0.0094 -0.2013 -0.2389 0.3105 -0.1066 -0.2667 0.2862 -0.2185 -0.1892 -0.1285 -0.1501 -0.1847 0.0955 0.0889 0.0985 0.0947 0.0927 0.1060 0.1045 0.0092 0.1185 0.0932 0.0883 0.0942 0.0891 0.0959 0.0954 0.1148 0.1243 0.1334 0.1392 0.1554 0.1436 0.1432 0.1565 0.1560 0.1601 0.1576
va: 2.1195 2.0456 2.0890 3.6008 3.7904 3.8783 3.9052 3.8830 3.8801 4.2257 3.7242 3.9246 3.9442 3.8402 3.7017 3.9318 3.9665 3.7114 3.8961 4.0009 3.6793 3.9515 3.8939 3.8485 3.8295 3.8418 1.0302 1.0389 1.0022 1.0083 1.0061 1.0024 1.0234 1.0297 1.0088 0.9963 1.0083 0.9957 1.0091 0.9973 0.9977 1.0116 0.9927 0.9822 1.0018 0.9895 1.0098 1.0084 0.9954 0.9906 0.9901 0.9911
dispcorr: -0.027477996 hartree
energy: -1117.896953303105
dipole: -32.00558 31.30087 -0.70471 0.52258 -0.27697 0.24561 0.67473 0.40982 1.08454
magnitude: 1.31650 au
magnitude: 3.34628 debye
