program: Orca
programVersion: 5.0.2
elementType: O O O C C C C C C C C C C C C C C C C C C C C C C C H H H H H H H H H H H H H H H H H H H H H H H H H H
charge: 0
multiplicity: 1
keywords: wb97x-d3
keywords: def2-TZVPP
keywords: def2/J RIJCOSX
keywords: DEFGRID2
keywords: scfconv7
keywords: smallprint printgap noloewdin
keywords: NOSOSCF
formula: C23H26O3
InChI: InChI=1/C23H26O3/c1-16(2)13-20-21(23(20,3)4)22(24)25-15-17-9-8-12-19(14-17)26-18-10-6-5-7-11-18/h5-14,20-21H,15H2,1-4H3
52 atoms
O  0.280968 -1.531199 -1.241874
O  -0.172836 -2.845458 0.50748
O  3.579025 2.365342 0.432647
C  -3.087136 -2.578686 -0.660823
C  -2.93772 -1.742559 0.573851
C  -1.927374 -1.600798 -0.540806
C  -4.151323 -2.20929 -1.66491
C  -2.857934 -4.065952 -0.55765
C  -3.84975 -0.614995 0.882523
C  -0.542008 -2.070709 -0.343118
C  -4.793828 -0.623423 1.828762
C  -5.656447 0.577537 2.075273
C  -5.086128 -1.800315 2.70886
C  1.673629 -1.871666 -1.174807
C  2.389599 -1.068175 -0.12597
C  2.622374 0.285897 -0.355897
C  2.818952 -1.652081 1.059578
C  3.270976 1.047821 0.605865
C  3.477619 -0.882428 2.009252
C  3.699326 0.467162 1.794391
C  2.841509 3.15324 -0.410158
C  3.534908 3.936998 -1.32037
C  1.456293 3.222376 -0.321018
C  2.83252 4.798551 -2.15209
C  0.766238 4.077301 -1.167659
C  1.44817 4.866957 -2.08508
H  -2.57037 -2.293701 1.434431
H  -2.016947 -0.716517 -1.163063
H  -4.273439 -1.131536 -1.77301
H  -5.117691 -2.622188 -1.366514
H  -3.909908 -2.614641 -2.649739
H  -2.166836 -4.340483 0.236592
H  -2.472724 -4.473271 -1.495489
H  -3.806182 -4.56659 -0.348993
H  -3.733883 0.284131 0.283437
H  -6.71422 0.336236 1.937879
H  -5.411483 1.406601 1.410696
H  -5.553325 0.93072 3.105211
H  -4.976661 -1.535282 3.764227
H  -4.448979 -2.661384 2.513013
H  -6.122988 -2.123518 2.580964
H  2.058464 -1.636299 -2.166515
H  1.802635 -2.942289 -1.011027
H  2.306673 0.729672 -1.292939
H  2.64563 -2.704839 1.24093
H  3.815089 -1.335305 2.932603
H  4.209256 1.069636 2.535943
H  4.614929 3.875786 -1.372293
H  0.918428 2.61856 0.39977
H  3.373853 5.412713 -2.860431
H  -0.313063 4.12948 -1.102596
H  0.903246 5.533762 -2.740453
elementType: O C H
totalener: -1117.86976258 hartree
nucrepener: 2204.31308161 hartree
electener: -3322.18284419 hartree
oneelecener: -5898.30095691 hartree
twoeener: 2576.11811272 hartree
cpcmener: -0.02452463 hartree
kineticenergy: 1112.78879205 hartree
xcener: -110.222119583737 hartree
chargesum: 0.0000000
charge: -0.286601 -0.475192 -0.327614 0.149252 -0.001268 -0.141789 -0.262252 -0.293074 -0.265532 0.418801 -0.032685 -0.227859 -0.250828 0.083161 -0.011041 -0.225321 -0.189108 0.288718 -0.122886 -0.250831 0.278003 -0.238194 -0.196835 -0.125347 -0.140393 -0.180946 0.095601 0.089463 0.089020 0.095092 0.098240 0.093353 0.099349 0.094595 0.119337 0.093004 0.088548 0.094340 0.096780 0.087712 0.095586 0.125568 0.112954 0.140341 0.138591 0.156215 0.145565 0.145631 0.157554 0.157727 0.159464 0.158030
qa: -0.2866 -0.4752 -0.3276 0.1493 -0.0013 -0.1418 -0.2623 -0.2931 -0.2655 0.4188 -0.0327 -0.2279 -0.2508 0.0832 -0.0110 -0.2253 -0.1891 0.2887 -0.1229 -0.2508 0.2780 -0.2382 -0.1968 -0.1253 -0.1404 -0.1809 0.0956 0.0895 0.0890 0.0951 0.0982 0.0934 0.0993 0.0946 0.1193 0.0930 0.0885 0.0943 0.0968 0.0877 0.0956 0.1256 0.1130 0.1403 0.1386 0.1562 0.1456 0.1456 0.1576 0.1577 0.1595 0.1580
va: 2.1241 2.0331 2.0784 3.6695 3.7717 3.8912 3.9068 3.9035 3.8731 4.1756 3.7122 3.9267 3.9442 3.8101 3.6496 3.9468 3.9298 3.7209 3.9196 4.0024 3.6951 4.0124 3.9295 3.8836 3.8846 3.9039 1.0280 1.0379 1.0032 1.0033 1.0028 1.0192 0.9993 1.0012 1.0082 0.9962 1.0081 0.9956 0.9979 1.0086 0.9974 0.9948 1.0109 1.0110 1.0150 0.9899 1.0073 1.0077 0.9967 0.9894 0.9902 0.9906
dispcorr: -0.023227337 hartree
energy: -1117.892989918772
dipole: -34.41326 33.52084 -0.89242 -10.71355 11.08416 0.37061 2.41307 -3.26784 -0.85476
magnitude: 1.29011 au
magnitude: 3.27920 debye
