program: Orca
programVersion: 5.0.2
elementType: O O O C C C C C C C C C C C C C C C C C C C C C C C H H H H H H H H H H H H H H H H H H H H H H H H H H
charge: 0
multiplicity: 1
keywords: wb97x-d3
keywords: def2-TZVPP
keywords: def2/J RIJCOSX
keywords: DEFGRID2
keywords: scfconv7
keywords: smallprint printgap noloewdin
keywords: NOSOSCF
formula: C23H26O3
InChI: InChI=1/C23H26O3/c1-16(2)13-20-21(23(20,3)4)22(24)25-15-17-9-8-12-19(14-17)26-18-10-6-5-7-11-18/h5-14,20-21H,15H2,1-4H3
52 atoms
O  0.657903 -2.108692 -1.475314
O  0.160302 -2.872686 0.563451
O  2.657558 2.212396 0.425084
C  -2.800554 -2.571007 -0.42712
C  -2.417255 -1.38826 0.402343
C  -1.52798 -1.814026 -0.763363
C  -3.910235 -2.447854 -1.444664
C  -2.740347 -3.94208 0.201555
C  -3.130746 -0.097693 0.358293
C  -0.182169 -2.332184 -0.461678
C  -3.104683 0.852912 1.300245
C  -3.91504 2.105553 1.147718
C  -2.298455 0.789382 2.561993
C  2.046284 -2.37099 -1.245536
C  2.625497 -1.398291 -0.25586
C  2.381092 -0.037956 -0.421036
C  3.37721 -1.840884 0.823732
C  2.853006 0.865757 0.519711
C  3.87918 -0.922993 1.736806
C  3.609538 0.428315 1.601269
C  1.581786 2.738134 -0.236943
C  1.817678 3.871409 -1.003138
C  0.295701 2.223333 -0.113021
C  0.760795 4.494522 -1.650748
C  -0.747677 2.846317 -0.782844
C  -0.524267 3.981086 -1.551111
H  -2.001002 -1.653436 1.368052
H  -1.58523 -1.200948 -1.655859
H  -3.890001 -1.505415 -1.990381
H  -4.886312 -2.534079 -0.9629
H  -3.835185 -3.249231 -2.182223
H  -3.721872 -4.200641 0.603485
H  -2.027173 -4.01159 1.019212
H  -2.480457 -4.701938 -0.538249
H  -3.740102 0.088105 -0.521189
H  -4.4725 2.127814 0.211135
H  -3.279653 2.994391 1.185094
H  -4.632856 2.208144 1.966629
H  -2.950455 0.784037 3.439649
H  -1.670376 1.679156 2.654132
H  -1.646005 -0.078861 2.627731
H  2.51027 -2.256495 -2.225187
H  2.202289 -3.4015 -0.921563
H  1.814204 0.30645 -1.277312
H  3.561024 -2.899365 0.959385
H  4.465937 -1.2651 2.579514
H  3.980282 1.142593 2.325812
H  2.823312 4.264634 -1.08543
H  0.098516 1.345463 0.490503
H  0.949634 5.380011 -2.243838
H  -1.745077 2.435096 -0.69786
H  -1.346364 4.4608 -2.065743
elementType: O C H
totalener: -1117.86912897 hartree
nucrepener: 2338.13586740 hartree
electener: -3456.00499636 hartree
oneelecener: -6165.80174993 hartree
twoeener: 2709.79675357 hartree
cpcmener: -0.02439752 hartree
kineticenergy: 1112.80240442 hartree
xcener: -110.229906401300 hartree
chargesum: 0.0000000
charge: -0.291904 -0.469326 -0.325887 0.105062 0.037212 -0.067077 -0.287523 -0.273820 -0.262453 0.375722 -0.074128 -0.234200 -0.269074 0.098286 0.034868 -0.275368 -0.228285 0.323278 -0.098903 -0.274640 0.316287 -0.262747 -0.232933 -0.106500 -0.116472 -0.215207 0.098472 0.089931 0.090107 0.101844 0.097518 0.095149 0.092607 0.097178 0.116932 0.093479 0.090378 0.105072 0.110050 0.092423 0.094203 0.123062 0.112404 0.141317 0.140463 0.157334 0.144858 0.144188 0.162651 0.156763 0.172933 0.154415
qa: -0.2919 -0.4693 -0.3259 0.1051 0.0372 -0.0671 -0.2875 -0.2738 -0.2625 0.3757 -0.0741 -0.2342 -0.2691 0.0983 0.0349 -0.2754 -0.2283 0.3233 -0.0989 -0.2746 0.3163 -0.2627 -0.2329 -0.1065 -0.1165 -0.2152 0.0985 0.0899 0.0901 0.1018 0.0975 0.0951 0.0926 0.0972 0.1169 0.0935 0.0904 0.1051 0.1101 0.0924 0.0942 0.1231 0.1124 0.1413 0.1405 0.1573 0.1449 0.1442 0.1627 0.1568 0.1729 0.1544
va: 2.1090 2.0373 2.0936 3.7694 3.7534 3.7682 3.9142 3.8949 3.8474 4.1882 3.7361 3.9100 3.9279 3.8077 3.6298 3.9336 3.9660 3.6955 3.8829 4.0142 3.7175 4.0166 3.9338 3.8745 3.8123 3.9744 1.0237 1.0345 1.0057 0.9998 1.0016 0.9998 1.0205 0.9998 1.0116 1.0062 0.9967 0.9981 0.9990 0.9967 1.0105 0.9931 1.0090 1.0149 1.0046 0.9886 1.0083 1.0089 0.9840 0.9885 0.9826 0.9948
dispcorr: -0.027539195 hartree
energy: -1117.896668161083
dipole: -25.96254 25.23939 -0.72315 -3.57673 3.85943 0.28270 2.94544 -3.74734 -0.80191
magnitude: 1.11620 au
magnitude: 2.83716 debye
