program: Orca
programVersion: 5.0.2
elementType: O O O C C C C C C C C C C C C C C C C C C C C C C C H H H H H H H H H H H H H H H H H H H H H H H H H H
charge: 0
multiplicity: 1
keywords: wb97x-d3
keywords: def2-TZVPP
keywords: def2/J RIJCOSX
keywords: DEFGRID2
keywords: scfconv7
keywords: smallprint printgap noloewdin
keywords: NOSOSCF
formula: C23H26O3
InChI: InChI=1/C23H26O3/c1-16(2)13-20-21(23(20,3)4)22(24)25-15-17-9-8-12-19(14-17)26-18-10-6-5-7-11-18/h5-14,20-21H,15H2,1-4H3
52 atoms
O  -0.181168 -0.684066 1.666935
O  -0.541731 -2.616692 0.604882
O  3.893163 1.538644 -0.88047
C  -2.505674 -0.784203 -1.046021
C  -3.2707 -1.677812 -0.116604
C  -2.131296 -0.837065 0.426601
C  -3.122234 0.50884 -1.522621
C  -1.621199 -1.425138 -2.087708
C  -4.650844 -1.38861 0.31661
C  -0.894559 -1.495737 0.88683
C  -5.647597 -2.269572 0.456505
C  -7.003926 -1.821128 0.912825
C  -5.542116 -3.740334 0.191366
C  1.093186 -1.149435 2.132243
C  2.134391 -1.044226 1.054881
C  2.509282 0.219414 0.603241
C  2.712849 -2.177619 0.500701
C  3.451858 0.338331 -0.407612
C  3.667193 -2.045562 -0.500038
C  4.034605 -0.79512 -0.965148
C  3.134025 2.666613 -0.69958
C  1.865806 2.770373 -1.256928
C  3.690787 3.721989 0.005289
C  1.151692 3.94839 -1.097512
C  2.969436 4.899776 0.14941
C  1.69874 5.015391 -0.395575
H  -3.021772 -2.728054 -0.221943
H  -2.409293 0.044263 0.994616
H  -2.345868 1.191729 -1.873934
H  -3.683582 1.028487 -0.747227
H  -3.80126 0.324665 -2.357958
H  -2.190497 -1.574966 -3.00753
H  -1.232606 -2.395743 -1.787573
H  -0.771371 -0.783036 -2.329988
H  -4.867729 -0.350116 0.549917
H  -7.769965 -2.068047 0.172654
H  -7.045683 -0.746791 1.093165
H  -7.295094 -2.328353 1.836891
H  -4.555088 -4.063826 -0.132759
H  -6.256807 -4.043093 -0.5786
H  -5.799313 -4.311023 1.087779
H  1.019098 -2.16783 2.516292
H  1.333451 -0.493338 2.968363
H  2.066996 1.099928 1.054199
H  2.422889 -3.160857 0.848162
H  4.120242 -2.927661 -0.933553
H  4.772081 -0.691279 -1.75128
H  1.440536 1.94268 -1.811527
H  4.68069 3.62373 0.433105
H  0.163514 4.033067 -1.531116
H  3.403851 5.726455 0.696659
H  1.138448 5.933927 -0.279923
elementType: O C H
totalener: -1117.87089434 hartree
nucrepener: 2228.21750178 hartree
electener: -3346.08839611 hartree
oneelecener: -5946.06773908 hartree
twoeener: 2599.97934296 hartree
cpcmener: -0.02528174 hartree
kineticenergy: 1112.80616613 hartree
xcener: -110.226415583798 hartree
chargesum: 0.0000000
charge: -0.286382 -0.470525 -0.328897 0.094808 0.037148 -0.091634 -0.272512 -0.270254 -0.271678 0.397447 -0.052838 -0.217378 -0.250293 0.085155 -0.015363 -0.214110 -0.197888 0.282546 -0.119135 -0.246844 0.241244 -0.176214 -0.207596 -0.155003 -0.142428 -0.162028 0.090962 0.089448 0.095890 0.088317 0.098096 0.096602 0.092353 0.095093 0.115499 0.092125 0.087486 0.092643 0.089907 0.095249 0.094647 0.113103 0.125390 0.135095 0.138592 0.155071 0.145675 0.161549 0.146989 0.158585 0.157749 0.158534
qa: -0.2864 -0.4705 -0.3289 0.0948 0.0371 -0.0916 -0.2725 -0.2703 -0.2717 0.3974 -0.0528 -0.2174 -0.2503 0.0852 -0.0154 -0.2141 -0.1979 0.2825 -0.1191 -0.2468 0.2412 -0.1762 -0.2076 -0.1550 -0.1424 -0.1620 0.0910 0.0894 0.0959 0.0883 0.0981 0.0966 0.0924 0.0951 0.1155 0.0921 0.0875 0.0926 0.0899 0.0952 0.0946 0.1131 0.1254 0.1351 0.1386 0.1551 0.1457 0.1615 0.1470 0.1586 0.1577 0.1585
va: 2.1210 2.0389 2.0756 3.7024 3.7829 3.8128 3.9112 3.9017 3.8786 4.2000 3.7713 3.9207 3.9403 3.8145 3.6620 3.9217 3.9355 3.7219 3.9183 3.9965 3.7312 3.9313 3.9948 3.8965 3.8900 3.8890 1.0329 1.0347 1.0023 1.0067 1.0016 1.0002 1.0203 1.0010 1.0119 0.9963 1.0090 0.9964 1.0111 0.9971 0.9969 1.0097 0.9941 1.0165 1.0121 0.9900 1.0072 0.9936 1.0054 0.9908 0.9897 0.9901
dispcorr: -0.023746882 hartree
energy: -1117.894641217211
dipole: -33.24761 32.46900 -0.77862 -7.84340 8.77866 0.93526 -3.89254 4.16475 0.27221
magnitude: 1.24702 au
magnitude: 3.16967 debye
