program: Orca
programVersion: 5.0.2
elementType: O O O C C C C C C C C C C C C C C C C C C C C C C C H H H H H H H H H H H H H H H H H H H H H H H H H H
charge: 0
multiplicity: 1
keywords: wb97x-d3
keywords: def2-TZVPP
keywords: def2/J RIJCOSX
keywords: DEFGRID2
keywords: scfconv7
keywords: smallprint printgap noloewdin
keywords: NOSOSCF
formula: C23H26O3
InChI: InChI=1/C23H26O3/c1-16(2)13-20-21(23(20,3)4)22(24)25-15-17-9-8-12-19(14-17)26-18-10-6-5-7-11-18/h5-14,20-21H,15H2,1-4H3
52 atoms
O  0.646996 -2.11224 -1.45452
O  0.170215 -2.755004 0.63064
O  2.715197 2.188627 0.418152
C  -2.792718 -2.581539 -0.402912
C  -2.454889 -1.357003 0.386002
C  -1.537981 -1.799345 -0.749418
C  -3.887413 -2.532902 -1.442132
C  -2.705018 -3.922279 0.285346
C  -3.210556 -0.094046 0.284756
C  -0.184128 -2.281248 -0.422755
C  -3.247213 0.883474 1.198226
C  -4.094797 2.101032 0.980567
C  -2.476101 0.888839 2.482957
C  2.032767 -2.392667 -1.236217
C  2.650225 -1.420209 -0.269549
C  2.40528 -0.059201 -0.424516
C  3.444429 -1.86653 0.777615
C  2.914895 0.841621 0.499503
C  3.987078 -0.951372 1.669587
C  3.715002 0.400849 1.547577
C  1.613485 2.717318 -0.196821
C  1.814134 3.869304 -0.945035
C  0.337113 2.186365 -0.045388
C  0.73197 4.492633 -1.549148
C  -0.732064 2.809455 -0.672692
C  -0.5439 3.961587 -1.424075
H  -2.046971 -1.575285 1.366996
H  -1.6009 -1.224737 -1.666743
H  -3.890749 -1.609176 -2.019607
H  -4.868938 -2.638657 -0.975274
H  -3.769464 -3.35474 -2.151275
H  -1.988164 -3.941018 1.103155
H  -2.432986 -4.710405 -0.419962
H  -3.680692 -4.179783 0.7029
H  -3.799663 0.0444 -0.616724
H  -4.83377 2.21169 1.779208
H  -4.6310 2.067005 0.032025
H  -3.49002 3.011856 0.995345
H  -1.786279 0.054219 2.589526
H  -3.152168 0.874099 3.342175
H  -1.893662 1.809802 2.569854
H  2.48613 -2.302192 -2.223821
H  2.173716 -3.42183 -0.899187
H  1.805647 0.287542 -1.257018
H  3.629427 -2.92588 0.904799
H  4.607368 -1.296336 2.486717
H  4.116003 1.112971 2.257898
H  2.812374 4.276472 -1.047296
H  0.167801 1.295044 0.54607
H  0.892908 5.393208 -2.127561
H  -1.720857 2.381818 -0.569383
H  -1.386015 4.441129 -1.905401
elementType: O C H
totalener: -1117.86898751 hartree
nucrepener: 2335.23413167 hartree
electener: -3453.10311918 hartree
oneelecener: -6160.00412636 hartree
twoeener: 2706.90100719 hartree
cpcmener: -0.02452591 hartree
kineticenergy: 1112.80385767 hartree
xcener: -110.230637142296 hartree
chargesum: -0.0000000
charge: -0.291753 -0.468082 -0.325587 0.103156 0.035487 -0.068741 -0.285779 -0.273717 -0.260681 0.377035 -0.073585 -0.227789 -0.268786 0.098801 0.037881 -0.279940 -0.230109 0.326249 -0.098259 -0.275802 0.332077 -0.270966 -0.259600 -0.097379 -0.095784 -0.228946 0.098104 0.089905 0.090139 0.101394 0.097483 0.092542 0.097016 0.095681 0.115314 0.104079 0.092745 0.088019 0.093675 0.110261 0.091820 0.122750 0.113006 0.142341 0.140177 0.157157 0.144813 0.144097 0.163959 0.156792 0.174269 0.153060
qa: -0.2918 -0.4681 -0.3256 0.1032 0.0355 -0.0687 -0.2858 -0.2737 -0.2607 0.3770 -0.0736 -0.2278 -0.2688 0.0988 0.0379 -0.2799 -0.2301 0.3262 -0.0983 -0.2758 0.3321 -0.2710 -0.2596 -0.0974 -0.0958 -0.2289 0.0981 0.0899 0.0901 0.1014 0.0975 0.0925 0.0970 0.0957 0.1153 0.1041 0.0927 0.0880 0.0937 0.1103 0.0918 0.1228 0.1130 0.1423 0.1402 0.1572 0.1448 0.1441 0.1640 0.1568 0.1743 0.1531
va: 2.1094 2.0386 2.0955 3.7690 3.7552 3.7655 3.9139 3.8960 3.8483 4.1866 3.7497 3.9052 3.9304 3.8049 3.6253 3.9334 3.9685 3.6946 3.8824 4.0141 3.7017 4.0225 3.9570 3.8651 3.7888 3.9852 1.0239 1.0345 1.0058 1.0001 1.0017 1.0204 1.0001 0.9997 1.0125 0.9973 1.0066 0.9981 1.0105 0.9991 0.9966 0.9927 1.0081 1.0146 1.0043 0.9886 1.0083 1.0092 0.9872 0.9885 0.9821 0.9962
dispcorr: -0.027460465 hartree
energy: -1117.896447974663
dipole: -26.57359 25.81542 -0.75818 -3.71383 3.89267 0.17884 2.59686 -3.43535 -0.83849
magnitude: 1.14450 au
magnitude: 2.90909 debye
