program: Orca
programVersion: 5.0.2
elementType: O O O C C C C C C C C C C C C C C C C C C C C C C C H H H H H H H H H H H H H H H H H H H H H H H H H H
charge: 0
multiplicity: 1
keywords: wb97x-d3
keywords: def2-TZVPP
keywords: def2/J RIJCOSX
keywords: DEFGRID2
keywords: scfconv7
keywords: smallprint printgap noloewdin
keywords: NOSOSCF
formula: C23H26O3
InChI: InChI=1/C23H26O3/c1-16(2)13-20-21(23(20,3)4)22(24)25-15-17-9-8-12-19(14-17)26-18-10-6-5-7-11-18/h5-14,20-21H,15H2,1-4H3
52 atoms
O  0.127947 -1.674946 -1.29208
O  -0.140819 -3.446494 0.049268
O  2.993621 2.570242 0.64276
C  -3.173594 -3.137421 -0.677394
C  -2.893182 -2.450819 0.613365
C  -2.031914 -2.135177 -0.600679
C  -4.357732 -2.68833 -1.500384
C  -2.8950 -4.615889 -0.803093
C  -3.781863 -1.406843 1.185882
C  -0.609991 -2.516868 -0.566128
C  -3.360892 -0.338204 1.868367
C  -4.326714 0.656008 2.437308
C  -1.915605 -0.033895 2.118591
C  1.559396 -1.756533 -1.202308
C  2.046232 -0.912665 -0.058377
C  2.288812 0.441711 -0.271331
C  2.215166 -1.453704 1.212693
C  2.68398 1.249729 0.787182
C  2.612236 -0.636628 2.261846
C  2.839888 0.714843 2.059893
C  2.421388 3.321966 -0.348375
C  3.264405 4.113652 -1.114539
C  1.045318 3.352397 -0.542642
C  2.724178 4.949652 -2.082341
C  0.520218 4.182739 -1.522073
C  1.35294 4.983479 -2.294249
H  -2.384112 -3.072952 1.346291
H  -2.228851 -1.183879 -1.081713
H  -5.27115 -3.182981 -1.16238
H  -4.214969 -2.947801 -2.551233
H  -4.524087 -1.611862 -1.447694
H  -2.575962 -4.872345 -1.816016
H  -3.809371 -5.177859 -0.59675
H  -2.134492 -4.970127 -0.111003
H  -4.851611 -1.54945 1.0575
H  -5.362871 0.401562 2.213394
H  -4.133522 1.658674 2.045861
H  -4.224206 0.725112 3.523608
H  -1.239098 -0.81407 1.774211
H  -1.732825 0.115178 3.185868
H  -1.625975 0.899047 1.62623
H  1.924245 -1.369089 -2.152603
H  1.888853 -2.791527 -1.109974
H  2.178049 0.8504 -1.268858
H  2.043278 -2.507525 1.384966
H  2.743383 -1.054517 3.251595
H  3.148774 1.352067 2.879116
H  4.334224 4.080703 -0.948325
H  0.386636 2.74131 0.062905
H  3.382969 5.570751 -2.676247
H  -0.551259 4.207206 -1.675431
H  0.934638 5.631929 -3.052955
elementType: O C H
totalener: -1117.86806696 hartree
nucrepener: 2256.74128596 hartree
electener: -3374.60935292 hartree
oneelecener: -6002.91651506 hartree
twoeener: 2628.30716214 hartree
cpcmener: -0.02306748 hartree
kineticenergy: 1112.78361859 hartree
xcener: -110.221141952672 hartree
chargesum: 0.0000000
charge: -0.284999 -0.475512 -0.327039 0.153934 -0.018626 -0.096263 -0.287828 -0.280924 -0.294703 0.377127 -0.012433 -0.228167 -0.227573 0.079222 -0.009910 -0.208555 -0.202934 0.281889 -0.123712 -0.243600 0.257240 -0.227537 -0.179506 -0.132945 -0.159383 -0.170106 0.104603 0.091430 0.098447 0.097231 0.092900 0.099049 0.092404 0.092470 0.121222 0.089142 0.094128 0.095861 0.069060 0.101841 0.097754 0.117371 0.113977 0.140015 0.143054 0.156790 0.146242 0.145774 0.169359 0.157200 0.157278 0.158239
qa: -0.2850 -0.4755 -0.3270 0.1539 -0.0186 -0.0963 -0.2878 -0.2809 -0.2947 0.3771 -0.0124 -0.2282 -0.2276 0.0792 -0.0099 -0.2086 -0.2029 0.2819 -0.1237 -0.2436 0.2572 -0.2275 -0.1795 -0.1329 -0.1594 -0.1701 0.1046 0.0914 0.0984 0.0972 0.0929 0.0990 0.0924 0.0925 0.1212 0.0891 0.0941 0.0959 0.0691 0.1018 0.0978 0.1174 0.1140 0.1400 0.1431 0.1568 0.1462 0.1458 0.1694 0.1572 0.1573 0.1582
va: 2.1132 2.0247 2.0783 3.6900 3.8155 3.7978 3.9116 3.8882 3.8925 4.1741 3.7257 3.9295 3.9463 3.8037 3.6679 3.9565 3.8987 3.7220 3.9191 4.0057 3.7159 3.9994 3.9158 3.8876 3.9094 3.8953 1.0266 1.0324 0.9997 1.0030 1.0017 0.9988 1.0012 1.0198 1.0042 1.0064 0.9965 0.9964 1.0113 1.0007 0.9984 0.9991 1.0152 1.0084 1.0182 0.9899 1.0068 1.0073 0.9848 0.9896 0.9915 0.9901
dispcorr: -0.025195366 hartree
energy: -1117.893262325413
dipole: -26.01039 25.37300 -0.63739 -8.14382 9.03786 0.89404 2.19913 -2.80649 -0.60737
magnitude: 1.25478 au
magnitude: 3.18939 debye
