program: Orca
programVersion: 5.0.2
elementType: O O O C C C C C C C C C C C C C C C C C C C C C C C H H H H H H H H H H H H H H H H H H H H H H H H H H
charge: 0
multiplicity: 1
keywords: wb97x-d3
keywords: def2-TZVPP
keywords: def2/J RIJCOSX
keywords: DEFGRID2
keywords: scfconv7
keywords: smallprint printgap noloewdin
keywords: NOSOSCF
formula: C23H26O3
InChI: InChI=1/C23H26O3/c1-16(2)13-20-21(23(20,3)4)22(24)25-15-17-9-8-12-19(14-17)26-18-10-6-5-7-11-18/h5-14,20-21H,15H2,1-4H3
52 atoms
O  0.236127 -2.437631 0.493122
O  0.70236 -2.250696 -1.680641
O  2.518595 2.04277 0.657073
C  -2.715626 -2.351804 -0.460466
C  -2.285261 -1.080338 0.205072
C  -1.459881 -1.644551 -0.942738
C  -3.875832 -2.344356 -1.427401
C  -2.626465 -3.640338 0.322275
C  -2.989065 0.204993 0.035894
C  -0.082316 -2.142754 -0.767218
C  -3.029804 1.210991 0.91766
C  -3.815815 2.45378 0.623398
C  -2.329613 1.227896 2.242448
C  1.589279 -2.783493 0.774502
C  2.525223 -1.61746 0.602603
C  2.071661 -0.313633 0.752331
C  3.865431 -1.847008 0.307283
C  2.942477 0.746445 0.542515
C  4.737101 -0.779734 0.154312
C  4.27909 0.526701 0.250462
C  1.390304 2.455696 0.005761
C  0.756642 3.576573 0.528469
C  0.903617 1.845162 -1.145531
C  -0.363691 4.090378 -0.106806
C  -0.226962 2.364708 -1.761258
C  -0.866064 3.485446 -1.251284
H  -1.839883 -1.234461 1.180593
H  -1.577056 -1.145506 -1.898725
H  -3.894574 -1.464173 -2.068919
H  -4.82537 -2.38433 -0.88934
H  -3.830633 -3.218386 -2.080132
H  -1.875671 -3.618698 1.109138
H  -2.402736 -4.483734 -0.33463
H  -3.587286 -3.844555 0.79938
H  -3.522045 0.341927 -0.900423
H  -4.640405 2.569821 1.333199
H  -4.237909 2.450479 -0.381789
H  -3.195751 3.347928 0.727425
H  -3.035874 1.427317 3.052961
H  -1.59533 2.038598 2.269104
H  -1.803701 0.305486 2.48148
H  1.912488 -3.629379 0.163836
H  1.577207 -3.116089 1.813246
H  1.038262 -0.110655 1.007192
H  4.226674 -2.86116 0.186592
H  5.779194 -0.963852 -0.072885
H  4.948278 1.363624 0.096004
H  1.145611 4.046792 1.423185
H  1.388478 0.976176 -1.571477
H  -0.848234 4.96765 0.30244
H  -0.603908 1.883988 -2.654993
H  -1.74525 3.883414 -1.740353
elementType: O C H
totalener: -1117.86774866 hartree
nucrepener: 2380.77485791 hartree
electener: -3498.64260657 hartree
oneelecener: -6251.17195306 hartree
twoeener: 2752.52934649 hartree
cpcmener: -0.02720120 hartree
kineticenergy: 1112.79310217 hartree
xcener: -110.230269433233 hartree
chargesum: 0.0000000
charge: -0.288064 -0.457679 -0.328847 0.085085 0.096504 -0.090616 -0.284945 -0.269380 -0.325131 0.379311 -0.043799 -0.231680 -0.256331 0.068909 0.051259 -0.232036 -0.232143 0.272246 -0.110080 -0.248856 0.330948 -0.270253 -0.192579 -0.125341 -0.167712 -0.186007 0.103945 0.092110 0.089980 0.099239 0.097441 0.091736 0.099403 0.095558 0.116909 0.109657 0.093100 0.084304 0.105696 0.091381 0.089102 0.118344 0.118633 0.151255 0.140934 0.156627 0.145401 0.142048 0.150549 0.158505 0.158192 0.157170
qa: -0.2881 -0.4577 -0.3288 0.0851 0.0965 -0.0906 -0.2849 -0.2694 -0.3251 0.3793 -0.0438 -0.2317 -0.2563 0.0689 0.0513 -0.2320 -0.2321 0.2722 -0.1101 -0.2489 0.3309 -0.2703 -0.1926 -0.1253 -0.1677 -0.1860 0.1039 0.0921 0.0900 0.0992 0.0974 0.0917 0.0994 0.0956 0.1169 0.1097 0.0931 0.0843 0.1057 0.0914 0.0891 0.1183 0.1186 0.1513 0.1409 0.1566 0.1454 0.1420 0.1505 0.1585 0.1582 0.1572
va: 2.1020 2.0415 2.0877 3.7850 3.6558 3.7887 3.9144 3.9016 3.8453 4.1673 3.7474 3.9133 3.9290 3.8121 3.5982 3.9442 3.9814 3.7229 3.8790 4.0226 3.6511 3.9703 3.8466 3.8390 3.8584 3.8419 1.0179 1.0290 1.0074 1.0005 1.0011 1.0146 1.0002 1.0000 1.0131 0.9975 1.0070 0.9991 0.9991 0.9987 1.0116 1.0072 0.9937 1.0005 1.0018 0.9888 1.0059 1.0108 1.0078 0.9890 0.9925 0.9894
dispcorr: -0.029881826 hartree
energy: -1117.897630486016
dipole: -25.93332 24.97239 -0.96093 -2.28431 1.92601 -0.35830 3.15626 -2.24810 0.90815
magnitude: 1.36986 au
magnitude: 3.48190 debye
