program: Orca
programVersion: 5.0.2
elementType: O O O C C C C C C C C C C C C C C C C C C C C C C C H H H H H H H H H H H H H H H H H H H H H H H H H H
charge: 0
multiplicity: 1
keywords: wb97x-d3
keywords: def2-TZVPP
keywords: def2/J RIJCOSX
keywords: DEFGRID2
keywords: scfconv7
keywords: smallprint printgap noloewdin
keywords: NOSOSCF
formula: C23H26O3
InChI: InChI=1/C23H26O3/c1-16(2)13-20-21(23(20,3)4)22(24)25-15-17-9-8-12-19(14-17)26-18-10-6-5-7-11-18/h5-14,20-21H,15H2,1-4H3
52 atoms
O  0.327917 -2.816569 0.248243
O  0.604806 -2.752224 -1.964196
O  2.223385 1.770288 1.40091
C  -2.673731 -2.673212 -0.22132
C  -2.148491 -1.278105 -0.063951
C  -1.520002 -2.216007 -1.091756
C  -3.974155 -2.906739 -0.955744
C  -2.475364 -3.652974 0.91127
C  -2.868685 -0.080265 -0.531854
C  -0.107906 -2.626445 -0.995138
C  -2.914316 1.111385 0.074877
C  -3.711178 2.237017 -0.513626
C  -2.231546 1.444951 1.366668
C  1.735077 -2.98097 0.440496
C  2.455072 -1.678541 0.238527
C  2.007377 -0.539374 0.90327
C  3.549101 -1.587016 -0.611253
C  2.656042 0.666063 0.709297
C  4.200216 -0.372793 -0.787233
C  3.754147 0.764992 -0.133864
C  1.414416 2.67168 0.77487
C  0.842341 2.458358 -0.47373
C  1.166526 3.851441 1.470165
C  0.027666 3.442038 -1.02235
C  0.350134 4.819468 0.909399
C  -0.223556 4.623366 -0.341308
H  -1.55036 -1.140542 0.829522
H  -1.79461 -2.016772 -2.121832
H  -4.037029 -3.943533 -1.292514
H  -4.090561 -2.273637 -1.8343
H  -4.825681 -2.722283 -0.297488
H  -2.301243 -4.663248 0.534732
H  -3.380919 -3.685555 1.520777
H  -1.653592 -3.392731 1.573307
H  -3.415685 -0.187944 -1.463863
H  -4.215951 1.949831 -1.436146
H  -3.072703 3.097918 -0.730643
H  -4.471045 2.588871 0.189916
H  -1.695338 2.393589 1.285413
H  -1.520116 0.690936 1.698176
H  -2.966984 1.575838 2.165829
H  2.134921 -3.761759 -0.208441
H  1.831821 -3.322565 1.471083
H  1.15759 -0.584104 1.57487
H  3.894774 -2.466661 -1.140108
H  5.055148 -0.309798 -1.447722
H  4.252169 1.716459 -0.273432
H  1.015596 1.543147 -1.024743
H  1.616169 4.006018 2.443357
H  -0.414845 3.271985 -1.995666
H  0.164349 5.735442 1.455748
H  -0.858332 5.383107 -0.777848
elementType: O C H
totalener: -1117.86781399 hartree
nucrepener: 2347.84818690 hartree
electener: -3465.71600088 hartree
oneelecener: -6185.12002829 hartree
twoeener: 2719.40402740 hartree
cpcmener: -0.02634440 hartree
kineticenergy: 1112.80967615 hartree
xcener: -110.229685462164 hartree
chargesum: 0.0000000
charge: -0.281057 -0.466676 -0.329481 0.101904 0.045561 -0.078796 -0.281662 -0.268941 -0.266538 0.384946 -0.059395 -0.213985 -0.257493 0.073630 -0.002885 -0.211943 -0.166663 0.199614 -0.142971 -0.161667 0.307787 -0.183437 -0.241439 -0.200677 -0.112732 -0.188049 0.097857 0.084385 0.098089 0.089301 0.097582 0.099029 0.092832 0.089589 0.114685 0.090026 0.085742 0.096581 0.068548 0.092412 0.115824 0.115599 0.117202 0.140696 0.143727 0.158580 0.153578 0.145736 0.142169 0.160293 0.155473 0.157510
qa: -0.2811 -0.4667 -0.3295 0.1019 0.0456 -0.0788 -0.2817 -0.2689 -0.2665 0.3849 -0.0594 -0.2140 -0.2575 0.0736 -0.0029 -0.2119 -0.1667 0.1996 -0.1430 -0.1617 0.3078 -0.1834 -0.2414 -0.2007 -0.1127 -0.1880 0.0979 0.0844 0.0981 0.0893 0.0976 0.0990 0.0928 0.0896 0.1147 0.0900 0.0857 0.0966 0.0685 0.0924 0.1158 0.1156 0.1172 0.1407 0.1437 0.1586 0.1536 0.1457 0.1422 0.1603 0.1555 0.1575
va: 2.1032 2.0397 2.0673 3.7099 3.7526 3.8085 3.9212 3.9006 3.8568 4.1918 3.7562 3.9146 3.9472 3.8281 3.6489 3.9857 3.9327 3.7958 3.8958 3.9668 3.6597 3.7986 3.9816 3.8776 3.8872 3.8665 1.0133 1.0332 1.0008 1.0072 1.0010 1.0010 0.9998 1.0148 1.0131 1.0096 0.9994 0.9959 1.0012 1.0079 1.0010 1.0081 0.9968 1.0147 1.0026 0.9897 0.9974 1.0097 1.0108 0.9905 0.9892 0.9907
dispcorr: -0.028766811 hartree
energy: -1117.896580799457
dipole: -24.71656 24.10480 -0.61176 -0.87307 0.92568 0.05261 0.90591 -0.17325 0.73266
magnitude: 0.95593 au
magnitude: 2.42979 debye
