program: Orca
programVersion: 5.0.2
elementType: O O O C C C C C C C C C C C C C C C C C C C C C C C H H H H H H H H H H H H H H H H H H H H H H H H H H
charge: 0
multiplicity: 1
keywords: wb97x-d3
keywords: def2-TZVPP
keywords: def2/J RIJCOSX
keywords: DEFGRID2
keywords: scfconv7
keywords: smallprint printgap noloewdin
keywords: NOSOSCF
formula: C23H26O3
InChI: InChI=1/C23H26O3/c1-16(2)13-20-21(23(20,3)4)22(24)25-15-17-9-8-12-19(14-17)26-18-10-6-5-7-11-18/h5-14,20-21H,15H2,1-4H3
52 atoms
O  0.146436 -2.304616 1.31356
O  -0.386482 -2.622402 -0.831577
O  1.738469 2.306555 0.145059
C  -2.754006 -0.737164 0.177767
C  -3.247549 -2.106903 -0.193926
C  -2.073065 -1.975051 0.741623
C  -3.544746 0.08779 1.162892
C  -2.074759 0.096793 -0.880566
C  -4.525563 -2.64907 0.319669
C  -0.716221 -2.342643 0.295413
C  -5.594871 -2.970369 -0.415183
C  -6.830673 -3.526727 0.225283
C  -5.679014 -2.814396 -1.902785
C  1.529975 -2.469732 1.00462
C  2.075477 -1.305941 0.223607
C  1.699131 -0.006312 0.549368
C  2.979003 -1.518085 -0.809451
C  2.207191 1.061625 -0.172983
C  3.495364 -0.438753 -1.513684
C  3.108492 0.856749 -1.211461
C  2.599259 3.368502 0.194199
C  3.873255 3.264923 0.740697
C  2.127853 4.586629 -0.274951
C  4.677103 4.394067 0.802254
C  2.939274 5.709468 -0.196473
C  4.2181 5.618456 0.335342
H  -2.981561 -2.411972 -1.200946
H  -2.263434 -2.151874 1.795264
H  -3.978064 -0.510062 1.96418
H  -4.362207 0.607152 0.657789
H  -2.908621 0.845675 1.624732
H  -2.817731 0.710313 -1.394819
H  -1.56788 -0.497289 -1.638795
H  -1.341431 0.77579 -0.439058
H  -4.588445 -2.794296 1.394602
H  -7.695265 -2.884568 0.036373
H  -6.72347 -3.636454 1.304493
H  -7.080194 -4.507414 -0.189035
H  -5.847313 -3.78031 -2.386061
H  -4.792193 -2.369405 -2.349389
H  -6.531678 -2.186084 -2.172372
H  1.70386 -3.408987 0.475458
H  2.019935 -2.544161 1.976165
H  1.003604 0.187556 1.357578
H  3.272295 -2.526747 -1.073298
H  4.192498 -0.608526 -2.323948
H  3.497431 1.689144 -1.784267
H  4.239664 2.319332 1.120438
H  1.131974 4.653325 -0.694887
H  5.669452 4.312861 1.226903
H  2.568498 6.658327 -0.562068
H  4.850919 6.494425 0.38931
elementType: O C H
totalener: -1117.87012283 hartree
nucrepener: 2205.58929909 hartree
electener: -3323.45942192 hartree
oneelecener: -5901.05312786 hartree
twoeener: 2577.59370595 hartree
cpcmener: -0.02606651 hartree
kineticenergy: 1112.80670120 hartree
xcener: -110.227348640313 hartree
chargesum: -0.0000000
charge: -0.287832 -0.455406 -0.335387 0.140909 0.018248 -0.111994 -0.265147 -0.286468 -0.279466 0.372026 -0.034064 -0.224474 -0.253168 0.098709 0.063664 -0.321241 -0.215293 0.293580 -0.125720 -0.198731 0.259304 -0.174038 -0.239697 -0.156357 -0.129026 -0.177315 0.091295 0.090850 0.088101 0.095833 0.098189 0.101730 0.095376 0.091178 0.118119 0.093081 0.088048 0.093306 0.096697 0.089924 0.094249 0.115113 0.120930 0.131719 0.140779 0.158517 0.158247 0.154854 0.145703 0.158550 0.156412 0.157585
qa: -0.2878 -0.4554 -0.3354 0.1409 0.0182 -0.1120 -0.2651 -0.2865 -0.2795 0.3720 -0.0341 -0.2245 -0.2532 0.0987 0.0637 -0.3212 -0.2153 0.2936 -0.1257 -0.1987 0.2593 -0.1740 -0.2397 -0.1564 -0.1290 -0.1773 0.0913 0.0908 0.0881 0.0958 0.0982 0.1017 0.0954 0.0912 0.1181 0.0931 0.0880 0.0933 0.0967 0.0899 0.0942 0.1151 0.1209 0.1317 0.1408 0.1585 0.1582 0.1549 0.1457 0.1585 0.1564 0.1576
va: 2.1121 2.0509 2.0425 3.6759 3.7893 3.8525 3.9023 3.8982 3.8724 4.2268 3.7282 3.9251 3.9445 3.7942 3.5871 4.0300 3.9787 3.6796 3.8965 3.9395 3.7213 3.8915 4.0004 3.9012 3.8951 3.8959 1.0320 1.0377 1.0040 1.0032 1.0030 1.0024 1.0165 1.0040 1.0088 0.9966 1.0086 0.9956 0.9972 1.0088 0.9977 1.0089 0.9928 1.0288 1.0035 0.9902 0.9950 0.9983 1.0079 0.9908 0.9898 0.9904
dispcorr: -0.024348853 hartree
energy: -1117.894471686187
dipole: -29.24945 29.44261 0.19316 -7.18436 7.57504 0.39068 -2.52574 3.10659 0.58086
magnitude: 0.72618 au
magnitude: 1.84580 debye
