program: Orca
programVersion: 5.0.2
elementType: O O O C C C C C C C C C C C C C C C C C C C C C C C H H H H H H H H H H H H H H H H H H H H H H H H H H
charge: 0
multiplicity: 1
keywords: wb97x-d3
keywords: def2-TZVPP
keywords: def2/J RIJCOSX
keywords: DEFGRID2
keywords: scfconv7
keywords: smallprint printgap noloewdin
keywords: NOSOSCF
formula: C23H26O3
InChI: InChI=1/C23H26O3/c1-16(2)13-20-21(23(20,3)4)22(24)25-15-17-9-8-12-19(14-17)26-18-10-6-5-7-11-18/h5-14,20-21H,15H2,1-4H3
52 atoms
O  0.198741 -2.206632 0.645072
O  0.679442 -2.829757 -1.442318
O  2.784792 2.019679 -0.475689
C  -2.738038 -2.458211 -0.381926
C  -2.318661 -1.039048 -0.1293
C  -1.461068 -1.92713 -1.007682
C  -3.868776 -2.744312 -1.34006
C  -2.681122 -3.434892 0.767103
C  -2.99566 0.126111 -0.735144
C  -0.102699 -2.374197 -0.641861
C  -3.474746 1.187922 -0.078389
C  -4.110682 2.327275 -0.816129
C  -3.433694 1.358677 1.409773
C  1.529232 -2.501376 1.058081
C  2.528473 -1.493244 0.557494
C  2.147825 -0.180159 0.29804
C  3.853905 -1.874952 0.390954
C  3.095282 0.73542 -0.140761
C  4.792778 -0.945862 -0.034555
C  4.423647 0.36112 -0.303771
C  1.65168 2.609193 0.023661
C  0.689452 3.044042 -0.873984
C  1.504082 2.822909 1.388115
C  -0.430205 3.71454 -0.399204
C  0.378315 3.487849 1.850557
C  -0.589625 3.93813 0.960976
H  -1.922802 -0.873945 0.866293
H  -1.538017 -1.749293 -2.075389
H  -3.87519 -2.077775 -2.202011
H  -4.832413 -2.643296 -0.836053
H  -3.800451 -3.766489 -1.717855
H  -1.948398 -3.166361 1.525084
H  -2.450916 -4.443313 0.416139
H  -3.65447 -3.475728 1.260636
H  -3.09265 0.115341 -1.81718
H  -3.611168 3.272127 -0.584755
H  -5.155644 2.453731 -0.520035
H  -4.082344 2.189279 -1.89701
H  -4.428785 1.593481 1.794193
H  -2.792628 2.199228 1.685673
H  -3.076845 0.481806 1.94488
H  1.817485 -3.51166 0.760178
H  1.488471 -2.481901 2.147873
H  1.115743 0.124566 0.420892
H  4.152834 -2.898138 0.583288
H  5.824852 -1.24421 -0.166008
H  5.152356 1.08513 -0.645883
H  0.8197 2.868172 -1.934415
H  2.263395 2.48282 2.081762
H  -1.179779 4.060934 -1.098975
H  0.262554 3.661948 2.912562
H  -1.460809 4.465289 1.327437
elementType: O C H
totalener: -1117.86786308 hartree
nucrepener: 2331.46205284 hartree
electener: -3449.32991592 hartree
oneelecener: -6152.45520622 hartree
twoeener: 2703.12529030 hartree
cpcmener: -0.02832225 hartree
kineticenergy: 1112.81021904 hartree
xcener: -110.230668183820 hartree
chargesum: 0.0000000
charge: -0.287069 -0.456440 -0.328090 0.113414 0.074308 -0.113783 -0.271167 -0.277773 -0.295884 0.387931 -0.055516 -0.218114 -0.254648 0.069474 0.030713 -0.212410 -0.252707 0.294341 -0.100851 -0.266965 0.260182 -0.216606 -0.180222 -0.136487 -0.127267 -0.203066 0.096024 0.088396 0.087349 0.095993 0.098499 0.091812 0.099809 0.094172 0.117067 0.079428 0.101924 0.091306 0.099871 0.091580 0.092277 0.117007 0.118566 0.138343 0.139297 0.156202 0.143693 0.145926 0.154828 0.162125 0.159145 0.164063
qa: -0.2871 -0.4564 -0.3281 0.1134 0.0743 -0.1138 -0.2712 -0.2778 -0.2959 0.3879 -0.0555 -0.2181 -0.2546 0.0695 0.0307 -0.2124 -0.2527 0.2943 -0.1009 -0.2670 0.2602 -0.2166 -0.1802 -0.1365 -0.1273 -0.2031 0.0960 0.0884 0.0873 0.0960 0.0985 0.0918 0.0998 0.0942 0.1171 0.0794 0.1019 0.0913 0.0999 0.0916 0.0923 0.1170 0.1186 0.1383 0.1393 0.1562 0.1437 0.1459 0.1548 0.1621 0.1591 0.1641
va: 2.0983 2.0496 2.0778 3.7136 3.6872 3.8656 3.9122 3.9101 3.8384 4.1636 3.7570 3.9200 3.9324 3.8151 3.6635 3.8978 3.9910 3.7177 3.8909 4.0095 3.7088 4.0011 3.9451 3.8271 3.8712 3.8515 1.0256 1.0352 1.0056 1.0021 1.0017 1.0139 0.9999 1.0008 1.0108 0.9975 0.9982 1.0080 0.9997 1.0021 1.0092 1.0085 0.9923 1.0167 1.0028 0.9887 1.0091 1.0060 0.9977 0.9855 0.9896 0.9871
dispcorr: -0.027304028 hartree
energy: -1117.895167112781
dipole: -28.72539 27.47531 -1.25008 -1.75823 2.10661 0.34838 3.54763 -2.07480 1.47284
magnitude: 1.96299 au
magnitude: 4.98951 debye
