program: Orca
programVersion: 5.0.2
elementType: O O O C C C C C C C C C C C C C C C C C C C C C C C H H H H H H H H H H H H H H H H H H H H H H H H H H
charge: 0
multiplicity: 1
keywords: wb97x-d3
keywords: def2-TZVPP
keywords: def2/J RIJCOSX
keywords: DEFGRID2
keywords: scfconv7
keywords: smallprint printgap noloewdin
keywords: NOSOSCF
formula: C23H26O3
InChI: InChI=1/C23H26O3/c1-16(2)13-20-21(23(20,3)4)22(24)25-15-17-9-8-12-19(14-17)26-18-10-6-5-7-11-18/h5-14,20-21H,15H2,1-4H3
52 atoms
O  -0.131675 -1.228673 1.516912
O  -0.248839 -2.34638 -0.414544
O  3.699352 1.840782 -0.115763
C  -2.403229 -0.15811 -1.111604
C  -3.084182 -1.404647 -0.666182
C  -1.983879 -0.812062 0.19789
C  -3.116348 1.164125 -0.959496
C  -1.501535 -0.208027 -2.319824
C  -4.483309 -1.42218 -0.166627
C  -0.717497 -1.544401 0.35885
C  -4.944796 -2.252653 0.771878
C  -6.375137 -2.217096 1.215421
C  -4.089279 -3.269238 1.463832
C  1.110601 -1.861635 1.823231
C  2.245727 -1.341947 0.986351
C  2.407809 0.028432 0.812196
C  3.158811 -2.222805 0.4195
C  3.470527 0.504518 0.057209
C  4.234286 -1.733375 -0.307755
C  4.391283 -0.370785 -0.503506
C  2.659605 2.703644 -0.324972
C  1.56136 2.37446 -1.111591
C  2.772536 3.968936 0.235672
C  0.570518 3.322602 -1.321906
C  1.779117 4.909964 0.007025
C  0.670719 4.590824 -0.765288
H  -2.773379 -2.298549 -1.202207
H  -2.312525 -0.289175 1.088861
H  -2.394945 1.982147 -0.910574
H  -3.727197 1.21268 -0.058787
H  -3.767761 1.352387 -1.814879
H  -0.69574 0.524455 -2.238713
H  -2.075695 0.038593 -3.214165
H  -1.052554 -1.184189 -2.481887
H  -5.17513 -0.717571 -0.620084
H  -6.86564 -3.178019 1.03939
H  -6.948412 -1.446924 0.699412
H  -6.446217 -2.027846 2.289837
H  -3.077857 -3.327182 1.065525
H  -4.534797 -4.264251 1.386425
H  -4.015344 -3.048659 2.532378
H  1.025419 -2.946099 1.731557
H  1.27898 -1.632397 2.875492
H  1.709407 0.721119 1.267022
H  3.030374 -3.290633 0.545853
H  4.947357 -2.419853 -0.745574
H  5.220049 0.014713 -1.083932
H  1.474119 1.393646 -1.562592
H  3.635682 4.213682 0.842384
H  -0.28326 3.065139 -1.935994
H  1.87228 5.895766 0.444591
H  -0.105805 5.324626 -0.936334
elementType: O C H
totalener: -1117.86865167 hartree
nucrepener: 2284.53219398 hartree
electener: -3402.40084565 hartree
oneelecener: -6058.56867765 hartree
twoeener: 2656.16783200 hartree
cpcmener: -0.02511960 hartree
kineticenergy: 1112.81350609 hartree
xcener: -110.229111068835 hartree
chargesum: -0.0000000
charge: -0.293391 -0.470739 -0.330398 0.159626 -0.028329 -0.094538 -0.288468 -0.273410 -0.296015 0.384490 -0.008280 -0.228260 -0.243998 0.101493 0.038656 -0.241303 -0.220705 0.273833 -0.113761 -0.253599 0.291914 -0.193090 -0.256508 -0.141849 -0.113830 -0.202167 0.104381 0.091007 0.091692 0.093690 0.099837 0.078710 0.099969 0.097582 0.122228 0.095663 0.089005 0.093805 0.081625 0.100126 0.099223 0.113451 0.122257 0.140357 0.140931 0.157450 0.146649 0.161041 0.144877 0.163176 0.157280 0.156609
qa: -0.2934 -0.4707 -0.3304 0.1596 -0.0283 -0.0945 -0.2885 -0.2734 -0.2960 0.3845 -0.0083 -0.2283 -0.2440 0.1015 0.0387 -0.2413 -0.2207 0.2738 -0.1138 -0.2536 0.2919 -0.1931 -0.2565 -0.1418 -0.1138 -0.2022 0.1044 0.0910 0.0917 0.0937 0.0998 0.0787 0.1000 0.0976 0.1222 0.0957 0.0890 0.0938 0.0816 0.1001 0.0992 0.1135 0.1223 0.1404 0.1409 0.1574 0.1466 0.1610 0.1449 0.1632 0.1573 0.1566
va: 2.1052 2.0337 2.0796 3.6796 3.8302 3.7936 3.9139 3.8836 3.8913 4.1517 3.7023 3.9315 3.9394 3.8014 3.6168 3.9323 3.9658 3.7199 3.8943 4.0157 3.7269 3.8907 4.0108 3.8731 3.8851 3.9443 1.0255 1.0330 1.0079 1.0027 0.9993 1.0060 1.0023 1.0214 1.0036 0.9963 1.0064 0.9963 1.0143 0.9996 0.9981 1.0099 0.9918 1.0171 1.0043 0.9891 1.0062 0.9922 1.0086 0.9857 0.9884 0.9923
dispcorr: -0.026303222 hartree
energy: -1117.894954891881
dipole: -30.08117 29.13399 -0.94718 -5.88867 6.21202 0.32335 -0.93820 1.66168 0.72348
magnitude: 1.23496 au
magnitude: 3.13902 debye
