program: Orca
programVersion: 5.0.2
elementType: O O O C C C C C C C C C C C C C C C C C C C C C C C H H H H H H H H H H H H H H H H H H H H H H H H H H
charge: 0
multiplicity: 1
keywords: wb97x-d3
keywords: def2-TZVPP
keywords: def2/J RIJCOSX
keywords: DEFGRID2
keywords: scfconv7
keywords: smallprint printgap noloewdin
keywords: NOSOSCF
formula: C23H26O3
InChI: InChI=1/C23H26O3/c1-16(2)13-20-21(23(20,3)4)22(24)25-15-17-9-8-12-19(14-17)26-18-10-6-5-7-11-18/h5-14,20-21H,15H2,1-4H3
52 atoms
O  0.417933 -2.37024 -1.1518
O  0.241488 -2.219305 1.06949
O  2.649363 2.103296 -0.240449
C  -2.835361 -2.297804 0.527112
C  -2.416747 -0.865481 0.590252
C  -1.670458 -1.815746 -0.323216
C  -4.076259 -2.654057 -0.256437
C  -2.615583 -3.185378 1.726495
C  -3.279588 0.220083 0.059694
C  -0.2675 -2.151313 -0.02366
C  -3.006436 1.083656 -0.922121
C  -4.006177 2.12268 -1.332441
C  -1.726685 1.11784 -1.698951
C  1.79959 -2.688729 -1.042102
C  2.654944 -1.543414 -0.569271
C  2.225305 -0.226305 -0.648172
C  3.925217 -1.820387 -0.070927
C  3.042994 0.794166 -0.180509
C  4.749906 -0.7889 0.348515
C  4.309201 0.526555 0.31365
C  1.426993 2.486423 0.233984
C  0.732059 1.784924 1.21368
C  0.913969 3.671481 -0.279964
C  -0.486625 2.275795 1.662241
C  -0.299647 4.153432 0.187204
C  -1.010656 3.456575 1.155081
H  -1.872041 -0.608687 1.497505
H  -1.888882 -1.734134 -1.381535
H  -4.968782 -2.553856 0.364908
H  -4.029959 -3.689528 -0.59982
H  -4.210698 -2.020618 -1.133258
H  -3.509949 -3.1759 2.353512
H  -1.781651 -2.870136 2.348814
H  -2.439654 -4.220571 1.42634
H  -4.240347 0.314783 0.561104
H  -3.606217 3.128794 -1.178512
H  -4.941688 2.042081 -0.778803
H  -4.237961 2.0438 -2.398164
H  -1.886446 0.773164 -2.724947
H  -0.936313 0.512881 -1.263167
H  -1.356605 2.14267 -1.775826
H  2.094245 -2.984041 -2.050113
H  1.943714 -3.557511 -0.395273
H  1.253136 0.017648 -1.058383
H  4.268519 -2.8461 -0.007098
H  5.738106 -1.01018 0.730565
H  4.938426 1.334116 0.665789
H  1.123068 0.865736 1.630964
H  1.467176 4.212286 -1.037901
H  -1.025733 1.725549 2.422865
H  -0.693396 5.077829 -0.21568
H  -1.961536 3.83002 1.511585
elementType: O C H
totalener: -1117.86755804 hartree
nucrepener: 2387.73095608 hartree
electener: -3505.59851413 hartree
oneelecener: -6265.22614428 hartree
twoeener: 2759.62763015 hartree
cpcmener: -0.02457348 hartree
kineticenergy: 1112.80146335 hartree
xcener: -110.233283773302 hartree
chargesum: -0.0000000
charge: -0.295500 -0.459477 -0.326998 0.122395 -0.014918 -0.032052 -0.278122 -0.284645 -0.295403 0.330894 -0.005845 -0.226264 -0.220424 0.062565 0.032720 -0.253007 -0.215021 0.259707 -0.119039 -0.244728 0.325205 -0.203181 -0.265878 -0.142840 -0.108995 -0.206719 0.091433 0.104374 0.097257 0.099146 0.090236 0.093523 0.093695 0.097962 0.113668 0.091801 0.088812 0.098133 0.119798 0.032092 0.100773 0.126942 0.116801 0.208275 0.140202 0.157046 0.145439 0.147644 0.141932 0.159807 0.154200 0.154580
qa: -0.2955 -0.4595 -0.3270 0.1224 -0.0149 -0.0321 -0.2781 -0.2846 -0.2954 0.3309 -0.0058 -0.2263 -0.2204 0.0626 0.0327 -0.2530 -0.2150 0.2597 -0.1190 -0.2447 0.3252 -0.2032 -0.2659 -0.1428 -0.1090 -0.2067 0.0914 0.1044 0.0973 0.0991 0.0902 0.0935 0.0937 0.0980 0.1137 0.0918 0.0888 0.0981 0.1198 0.0321 0.1008 0.1269 0.1168 0.2083 0.1402 0.1570 0.1454 0.1476 0.1419 0.1598 0.1542 0.1546
va: 2.1128 2.0351 2.0872 3.7898 3.7706 3.7692 3.8992 3.8874 3.8350 4.1695 3.7348 3.9235 3.8960 3.8206 3.6130 3.9442 3.9663 3.7440 3.8834 4.0191 3.6551 3.8335 3.9807 3.8372 3.8522 3.8652 1.0225 1.0260 1.0018 1.0027 1.0053 1.0006 1.0215 0.9990 1.0087 0.9969 1.0070 0.9976 1.0034 1.0277 1.0017 0.9895 1.0088 0.9550 1.0009 0.9889 1.0061 1.0097 1.0107 0.9891 0.9900 0.9927
dispcorr: -0.031047447 hartree
energy: -1117.898605490622
dipole: -25.26235 24.55605 -0.70631 -3.14572 2.76920 -0.37652 -2.36225 1.53379 -0.82846
magnitude: 1.15195 au
magnitude: 2.92802 debye
