program: Orca
programVersion: 5.0.2
elementType: O O O C C C C C C C C C C C C C C C C C C C C C C C H H H H H H H H H H H H H H H H H H H H H H H H H H
charge: 0
multiplicity: 1
keywords: wb97x-d3
keywords: def2-TZVPP
keywords: def2/J RIJCOSX
keywords: DEFGRID2
keywords: scfconv7
keywords: smallprint printgap noloewdin
keywords: NOSOSCF
formula: C23H26O3
InChI: InChI=1/C23H26O3/c1-16(2)13-20-21(23(20,3)4)22(24)25-15-17-9-8-12-19(14-17)26-18-10-6-5-7-11-18/h5-14,20-21H,15H2,1-4H3
52 atoms
O  0.30517 -2.270528 -1.183217
O  -0.443401 -0.168792 -1.361715
O  3.823376 1.795121 0.450159
C  -2.325516 -1.070167 0.968384
C  -3.091147 -1.131371 -0.318895
C  -1.748254 -1.820548 -0.222376
C  -2.771808 -1.92758 2.127474
C  -1.754303 0.257551 1.400994
C  -4.312941 -1.954178 -0.467948
C  -0.589641 -1.304673 -0.97464
C  -5.551633 -1.487106 -0.6502
C  -6.716129 -2.421246 -0.782185
C  -5.901326 -0.032785 -0.725655
C  1.55056 -1.931483 -1.812138
C  2.518113 -1.39391 -0.797194
C  2.723547 -0.025635 -0.673807
C  3.187824 -2.269844 0.054203
C  3.574632 0.457849 0.312049
C  4.052073 -1.777125 1.019035
C  4.242304 -0.409932 1.162064
C  2.788275 2.688325 0.409402
C  1.545368 2.415035 0.969371
C  3.044954 3.921546 -0.173934
C  0.558575 3.389762 0.935077
C  2.050441 4.888564 -0.193776
C  0.802302 4.627241 0.354475
H  -3.0746 -0.204076 -0.88317
H  -1.775653 -2.901046 -0.129043
H  -3.120601 -2.911931 1.817138
H  -3.587941 -1.44339 2.668053
H  -1.9520 -2.075744 2.833104
H  -2.46608 0.759333 2.059999
H  -1.554898 0.928808 0.569235
H  -0.827255 0.125713 1.963509
H  -4.179201 -3.030961 -0.411095
H  -6.414454 -3.467423 -0.727367
H  -7.237055 -2.270909 -1.731668
H  -7.453825 -2.24218 0.004904
H  -5.041368 0.629574 -0.64637
H  -6.595285 0.23359 0.076194
H  -6.414788 0.195751 -1.66318
H  1.396291 -1.23139 -2.633792
H  1.912118 -2.86921 -2.23174
H  2.22008 0.65942 -1.344657
H  3.039767 -3.338485 -0.043487
H  4.576625 -2.459141 1.675597
H  4.906213 -0.019255 1.923058
H  1.341972 1.458676 1.434768
H  4.018055 4.121633 -0.604991
H  -0.408008 3.176674 1.37401
H  2.254278 5.849429 -0.648614
H  0.027254 5.382042 0.332564
elementType: O C H
totalener: -1117.86943917 hartree
nucrepener: 2259.56562383 hartree
electener: -3377.43506300 hartree
oneelecener: -6009.00735797 hartree
twoeener: 2631.57229497 hartree
cpcmener: -0.02475220 hartree
kineticenergy: 1112.81049615 hartree
xcener: -110.226694781279 hartree
chargesum: 0.0000000
charge: -0.284187 -0.472297 -0.332685 0.167161 0.012049 -0.137270 -0.261945 -0.318480 -0.274477 0.411596 -0.034421 -0.224148 -0.251603 0.079340 -0.020801 -0.148223 -0.218426 0.243277 -0.125144 -0.233550 0.283588 -0.196505 -0.246119 -0.149730 -0.122545 -0.190843 0.096572 0.088412 0.088567 0.095272 0.097785 0.099164 0.088313 0.104251 0.118842 0.088145 0.093455 0.093097 0.088835 0.095880 0.095669 0.114831 0.123502 0.141606 0.142910 0.157492 0.146644 0.161570 0.144659 0.166497 0.157318 0.157103
qa: -0.2842 -0.4723 -0.3327 0.1672 0.0120 -0.1373 -0.2619 -0.3185 -0.2745 0.4116 -0.0344 -0.2241 -0.2516 0.0793 -0.0208 -0.1482 -0.2184 0.2433 -0.1251 -0.2336 0.2836 -0.1965 -0.2461 -0.1497 -0.1225 -0.1908 0.0966 0.0884 0.0886 0.0953 0.0978 0.0992 0.0883 0.1043 0.1188 0.0881 0.0935 0.0931 0.0888 0.0959 0.0957 0.1148 0.1235 0.1416 0.1429 0.1575 0.1466 0.1616 0.1447 0.1665 0.1573 0.1571
va: 2.1282 2.0331 2.0756 3.6469 3.7715 3.9090 3.9029 3.9065 3.8737 4.1707 3.7265 3.9249 3.9446 3.8129 3.6486 3.8758 3.9700 3.7560 3.8930 4.0176 3.7204 3.8927 4.0044 3.8860 3.8939 3.9277 1.0263 1.0390 1.0044 1.0035 1.0026 1.0026 1.0150 0.9947 1.0088 1.0084 0.9961 0.9963 1.0090 0.9971 0.9978 1.0118 0.9942 1.0222 1.0033 0.9890 1.0056 0.9910 1.0086 0.9861 0.9886 0.9914
dispcorr: -0.025465829 hartree
energy: -1117.894904994935
dipole: -33.87814 33.14318 -0.73496 -6.73189 5.82218 -0.90970 5.06614 -4.63384 0.43230
magnitude: 1.24684 au
magnitude: 3.16921 debye
