program: Orca
programVersion: 5.0.2
elementType: O O O C C C C C C C C C C C C C C C C C C C C C C C H H H H H H H H H H H H H H H H H H H H H H H H H H
charge: 0
multiplicity: 1
keywords: wb97x-d3
keywords: def2-TZVPP
keywords: def2/J RIJCOSX
keywords: DEFGRID2
keywords: scfconv7
keywords: smallprint printgap noloewdin
keywords: NOSOSCF
formula: C23H26O3
InChI: InChI=1/C23H26O3/c1-16(2)13-20-21(23(20,3)4)22(24)25-15-17-9-8-12-19(14-17)26-18-10-6-5-7-11-18/h5-14,20-21H,15H2,1-4H3
52 atoms
O  0.312555 -1.354527 1.762348
O  -0.159918 -2.531607 -0.075338
O  3.732865 1.865289 -0.474316
C  -2.351342 -0.273462 -0.368093
C  -2.985109 -1.549253 0.100629
C  -1.776705 -1.012091 0.831221
C  -3.037069 1.03601 -0.062927
C  -1.628469 -0.269584 -1.691869
C  -4.29564 -1.569399 0.792523
C  -0.487041 -1.723288 0.760158
C  -5.433758 -2.052755 0.286636
C  -6.704055 -2.032723 1.081446
C  -5.556964 -2.645832 -1.083496
C  1.618859 -1.93114 1.815059
C  2.534431 -1.370663 0.763704
C  2.660463 0.007558 0.62036
C  3.285762 -2.219126 -0.040133
C  3.53289 0.520814 -0.329112
C  4.170006 -1.693037 -0.971342
C  4.29342 -0.321808 -1.128308
C  2.671033 2.726409 -0.445062
C  2.862537 3.944567 0.191105
C  1.465326 2.436307 -1.072447
C  1.838955 4.881373 0.195242
C  0.44811 3.379497 -1.052637
C  0.626991 4.602832 -0.420604
H  -2.776147 -2.40488 -0.534472
H  -1.968446 -0.534251 1.786096
H  -3.816724 1.240083 -0.80079
H  -2.322392 1.861524 -0.099195
H  -3.504713 1.050074 0.921849
H  -0.799661 0.441871 -1.6872
H  -2.317187 0.038086 -2.481499
H  -1.232564 -1.243588 -1.970612
H  -4.320762 -1.148852 1.793909
H  -6.562358 -1.611296 2.076814
H  -7.110759 -3.041028 1.198671
H  -7.475821 -1.447369 0.574446
H  -5.834177 -3.701451 -1.027876
H  -4.646421 -2.570512 -1.674103
H  -6.353437 -2.150221 -1.643683
H  1.566226 -3.019521 1.746149
H  1.985594 -1.681481 2.811454
H  2.089914 0.676536 1.254544
H  3.182213 -3.29204 0.063595
H  4.75649 -2.355549 -1.594508
H  4.973225 0.094683 -1.860852
H  3.807845 4.158053 0.673879
H  1.316907 1.490916 -1.578982
H  1.991933 5.832173 0.689002
H  -0.489974 3.154912 -1.544156
H  -0.170517 5.334058 -0.41208
elementType: O C H
totalener: -1117.86970778 hartree
nucrepener: 2265.84628094 hartree
electener: -3383.71598873 hartree
oneelecener: -6021.20918166 hartree
twoeener: 2637.49319293 hartree
cpcmener: -0.02570774 hartree
kineticenergy: 1112.81312551 hartree
xcener: -110.228161768092 hartree
chargesum: 0.0000000
charge: -0.288911 -0.464934 -0.332362 0.156560 0.007582 -0.130158 -0.264162 -0.279323 -0.278762 0.395162 -0.027397 -0.227324 -0.253952 0.097389 0.028006 -0.221388 -0.212414 0.256923 -0.116400 -0.244995 0.275593 -0.246807 -0.179703 -0.119081 -0.156898 -0.193164 0.095322 0.089373 0.096721 0.092125 0.089652 0.074524 0.099514 0.096858 0.119289 0.088385 0.093777 0.093780 0.098474 0.089480 0.093527 0.114352 0.122998 0.139594 0.140777 0.156324 0.146735 0.145430 0.166098 0.157378 0.163223 0.157212
qa: -0.2889 -0.4649 -0.3324 0.1566 0.0076 -0.1302 -0.2642 -0.2793 -0.2788 0.3952 -0.0274 -0.2273 -0.2540 0.0974 0.0280 -0.2214 -0.2124 0.2569 -0.1164 -0.2450 0.2756 -0.2468 -0.1797 -0.1191 -0.1569 -0.1932 0.0953 0.0894 0.0967 0.0921 0.0897 0.0745 0.0995 0.0969 0.1193 0.0884 0.0938 0.0938 0.0985 0.0895 0.0935 0.1144 0.1230 0.1396 0.1408 0.1563 0.1467 0.1454 0.1661 0.1574 0.1632 0.1572
va: 2.1169 2.0445 2.0720 3.6458 3.7815 3.8877 3.9106 3.8994 3.8825 4.1911 3.7111 3.9267 3.9446 3.8031 3.6223 3.9242 3.9552 3.7286 3.8981 4.0119 3.7269 4.0090 3.8792 3.8907 3.8857 3.9318 1.0277 1.0389 1.0024 1.0060 1.0047 1.0089 1.0019 1.0212 1.0082 1.0084 0.9952 0.9964 0.9971 1.0081 0.9981 1.0091 0.9925 1.0167 1.0050 0.9896 1.0061 1.0081 0.9894 0.9887 0.9862 0.9917
dispcorr: -0.025750047 hartree
energy: -1117.895457831592
dipole: -33.66652 32.78568 -0.88084 -4.37122 4.84858 0.47736 -3.18756 3.68042 0.49286
magnitude: 1.11654 au
magnitude: 2.83802 debye
