program: Orca
programVersion: 5.0.2
elementType: O O O C C C C C C C C C C C C C C C C C C C C C C C H H H H H H H H H H H H H H H H H H H H H H H H H H
charge: 0
multiplicity: 1
keywords: wb97x-d3
keywords: def2-TZVPP
keywords: def2/J RIJCOSX
keywords: DEFGRID2
keywords: scfconv7
keywords: smallprint printgap noloewdin
keywords: NOSOSCF
formula: C23H26O3
InChI: InChI=1/C23H26O3/c1-16(2)13-20-21(23(20,3)4)22(24)25-15-17-9-8-12-19(14-17)26-18-10-6-5-7-11-18/h5-14,20-21H,15H2,1-4H3
52 atoms
O  0.315455 -2.751826 0.341414
O  -0.395807 -0.888954 1.349093
O  3.257554 2.236054 -0.133755
C  -3.260808 -2.091647 0.963641
C  -2.939361 -1.247314 -0.218929
C  -1.952978 -2.324896 0.229634
C  -4.270171 -3.205296 0.816152
C  -3.282798 -1.454949 2.331892
C  -3.622485 -1.371287 -1.529533
C  -0.635476 -1.894096 0.7214
C  -3.13046 -0.907925 -2.682317
C  -3.892018 -1.037869 -3.965567
C  -1.799179 -0.229194 -2.794401
C  1.677456 -2.361184 0.548428
C  2.049175 -1.213843 -0.348627
C  2.50767 -0.02272 0.194148
C  1.900368 -1.329496 -1.729333
C  2.791241 1.052326 -0.638163
C  2.202112 -0.255424 -2.550956
C  2.638359 0.947264 -2.010726
C  2.590022 2.851923 0.887164
C  1.225221 2.697547 1.104327
C  3.34052 3.698176 1.694317
C  0.622307 3.390371 2.145339
C  2.720844 4.390683 2.723392
C  1.361072 4.237521 2.959102
H  -2.605009 -0.243871 0.031647
H  -1.928292 -3.217546 -0.384767
H  -4.121168 -3.959053 1.59177
H  -4.203067 -3.711953 -0.146694
H  -5.287548 -2.822365 0.921296
H  -2.977413 -2.165273 3.102791
H  -4.300692 -1.136368 2.56641
H  -2.64284 -0.579267 2.408664
H  -4.595027 -1.855054 -1.540282
H  -4.856494 -1.526257 -3.825074
H  -3.325308 -1.615246 -4.70098
H  -4.073195 -0.058733 -4.417418
H  -1.921854 0.82339 -3.06553
H  -1.202033 -0.68285 -3.589719
H  -1.214563 -0.268313 -1.876376
H  2.255755 -3.252248 0.305161
H  1.860381 -2.120007 1.597155
H  2.623488 0.071339 1.267633
H  1.5467 -2.256178 -2.164604
H  2.085688 -0.345811 -3.623199
H  2.858735 1.79413 -2.648283
H  0.627025 2.047992 0.478022
H  4.402168 3.812548 1.513331
H  -0.439699 3.264759 2.313534
H  3.310266 5.048959 3.348759
H  0.882205 4.774494 3.767229
elementType: O C H
totalener: -1117.86821869 hartree
nucrepener: 2291.04562984 hartree
electener: -3408.91384852 hartree
oneelecener: -6072.01710853 hartree
twoeener: 2663.10326001 hartree
cpcmener: -0.02399111 hartree
kineticenergy: 1112.81236875 hartree
xcener: -110.227928193177 hartree
chargesum: 0.0000000
charge: -0.287671 -0.473998 -0.331118 0.165966 -0.040434 -0.077840 -0.294057 -0.277084 -0.282474 0.371156 -0.002758 -0.227580 -0.241582 0.096337 0.049735 -0.202582 -0.268424 0.262456 -0.122820 -0.223988 0.291676 -0.183316 -0.251781 -0.156680 -0.121405 -0.188740 0.105097 0.088206 0.098053 0.089551 0.100576 0.098325 0.093227 0.093484 0.122900 0.088847 0.095129 0.094559 0.104907 0.094236 0.063348 0.125112 0.112164 0.142545 0.140143 0.157439 0.147196 0.149958 0.143862 0.157728 0.155811 0.156606
qa: -0.2877 -0.4740 -0.3311 0.1660 -0.0404 -0.0778 -0.2941 -0.2771 -0.2825 0.3712 -0.0028 -0.2276 -0.2416 0.0963 0.0497 -0.2026 -0.2684 0.2625 -0.1228 -0.2240 0.2917 -0.1833 -0.2518 -0.1567 -0.1214 -0.1887 0.1051 0.0882 0.0981 0.0896 0.1006 0.0983 0.0932 0.0935 0.1229 0.0888 0.0951 0.0946 0.1049 0.0942 0.0633 0.1251 0.1122 0.1425 0.1401 0.1574 0.1472 0.1500 0.1439 0.1577 0.1558 0.1566
va: 2.1123 2.0250 2.0747 3.7098 3.8330 3.7935 3.9155 3.8798 3.8827 4.1703 3.7186 3.9268 3.9490 3.8020 3.5623 3.9428 3.9176 3.7251 3.8484 4.0167 3.7002 3.8741 3.9969 3.9073 3.8910 3.9053 1.0229 1.0345 1.0027 1.0014 0.9988 0.9995 1.0007 1.0204 1.0042 1.0069 0.9965 0.9955 0.9991 0.9993 1.0105 0.9925 1.0099 1.0094 1.0110 0.9891 1.0042 1.0056 1.0093 0.9918 0.9893 0.9908
dispcorr: -0.026223723 hartree
energy: -1117.894442410295
dipole: -26.16936 25.54467 -0.62469 -9.22965 8.31346 -0.91619 -6.62606 5.98740 -0.63866
magnitude: 1.27966 au
magnitude: 3.25263 debye
