program: Orca
programVersion: 5.0.2
elementType: O O O C C C C C C C C C C C C C C C C C C C C C C C H H H H H H H H H H H H H H H H H H H H H H H H H H
charge: 0
multiplicity: 1
keywords: wb97x-d3
keywords: def2-TZVPP
keywords: def2/J RIJCOSX
keywords: DEFGRID2
keywords: scfconv7
keywords: smallprint printgap noloewdin
keywords: NOSOSCF
formula: C23H26O3
InChI: InChI=1/C23H26O3/c1-16(2)13-20-21(23(20,3)4)22(24)25-15-17-9-8-12-19(14-17)26-18-10-6-5-7-11-18/h5-14,20-21H,15H2,1-4H3
52 atoms
O  0.023161 -1.493046 0.222969
O  -1.347776 -1.76301 1.962222
O  3.708143 2.356639 -1.028996
C  -3.149093 -3.175281 -0.183715
C  -3.640504 -1.776849 0.031847
C  -2.178342 -2.007497 -0.273057
C  -3.469492 -3.858478 -1.490401
C  -3.11738 -4.123425 0.988426
C  -4.486005 -1.074973 -0.965476
C  -1.163631 -1.752082 0.766998
C  -5.812243 -0.938328 -0.883921
C  -6.584922 -0.204002 -1.936698
C  -6.635966 -1.49787 0.234646
C  1.114693 -1.217388 1.113772
C  2.264148 -0.757837 0.27064
C  2.442098 0.601685 0.042908
C  3.131945 -1.676877 -0.310002
C  3.498664 1.037836 -0.745938
C  4.170103 -1.231882 -1.114613
C  4.364248 0.123968 -1.331159
C  3.441756 3.322904 -0.097508
C  2.873446 4.501517 -0.559417
C  3.774902 3.175208 1.244007
C  2.632932 5.539375 0.329656
C  3.514754 4.21602 2.123759
C  2.943662 5.399494 1.674972
H  -3.843651 -1.534806 1.071275
H  -1.856609 -1.763875 -1.280083
H  -3.440547 -3.177348 -2.340756
H  -4.469451 -4.297011 -1.455187
H  -2.761024 -4.665436 -1.688036
H  -2.306859 -4.849153 0.890125
H  -4.053651 -4.684579 1.026101
H  -3.0033 -3.620681 1.946027
H  -3.977103 -0.648236 -1.825274
H  -5.940463 0.188722 -2.723476
H  -7.138779 0.634868 -1.5063
H  -7.328277 -0.855773 -2.403739
H  -7.400216 -2.175417 -0.155465
H  -7.171592 -0.703023 0.760686
H  -6.051526 -2.050162 0.968942
H  1.371936 -2.121701 1.669858
H  0.830538 -0.44572 1.83125
H  1.754578 1.310933 0.488625
H  2.997165 -2.736785 -0.1327
H  4.846738 -1.944274 -1.568438
H  5.182882 0.47323 -1.947881
H  2.625432 4.605272 -1.608355
H  4.233518 2.263837 1.606716
H  2.190935 6.458046 -0.03392
H  3.768864 4.098782 3.169385
H  2.746648 6.206739 2.367911
elementType: O C H
totalener: -1117.87020825 hartree
nucrepener: 2138.03814027 hartree
electener: -3255.90834852 hartree
oneelecener: -5765.45310547 hartree
twoeener: 2509.54475696 hartree
cpcmener: -0.02510176 hartree
kineticenergy: 1112.80983097 hartree
xcener: -110.224674268318 hartree
chargesum: 0.0000000
charge: -0.278032 -0.478491 -0.328312 0.145125 -0.011843 -0.123434 -0.265176 -0.298488 -0.253654 0.407472 -0.036883 -0.229182 -0.248885 0.079160 -0.026533 -0.177111 -0.204918 0.270036 -0.126450 -0.237917 0.290847 -0.249386 -0.199897 -0.120027 -0.141159 -0.188375 0.098631 0.087896 0.090648 0.094837 0.098915 0.100273 0.094429 0.094800 0.120383 0.089113 0.093983 0.093903 0.095005 0.098605 0.087325 0.120128 0.106886 0.141276 0.143252 0.157624 0.146947 0.146050 0.156434 0.157210 0.159089 0.157870
qa: -0.2780 -0.4785 -0.3283 0.1451 -0.0118 -0.1234 -0.2652 -0.2985 -0.2537 0.4075 -0.0369 -0.2292 -0.2489 0.0792 -0.0265 -0.1771 -0.2049 0.2700 -0.1265 -0.2379 0.2908 -0.2494 -0.1999 -0.1200 -0.1412 -0.1884 0.0986 0.0879 0.0906 0.0948 0.0989 0.1003 0.0944 0.0948 0.1204 0.0891 0.0940 0.0939 0.0950 0.0986 0.0873 0.1201 0.1069 0.1413 0.1433 0.1576 0.1469 0.1461 0.1564 0.1572 0.1591 0.1579
va: 2.1268 2.0257 2.0795 3.6649 3.7790 3.9228 3.9069 3.8992 3.8661 4.1574 3.7062 3.9277 3.9412 3.8056 3.7649 3.8954 3.9436 3.7303 3.9026 4.0061 3.6894 4.0090 3.9138 3.8830 3.8896 3.9086 1.0250 1.0375 1.0025 1.0027 1.0028 0.9995 1.0009 1.0198 1.0071 1.0078 0.9956 0.9962 0.9976 0.9984 1.0083 0.9967 1.0023 1.0075 1.0025 0.9893 1.0065 1.0081 0.9968 0.9894 0.9901 0.9907
dispcorr: -0.022351367 hartree
energy: -1117.892559612346
dipole: -35.71300 35.50190 -0.21110 -15.12395 14.94105 -0.18290 -2.86957 2.42723 -0.44233
magnitude: 0.52314 au
magnitude: 1.32970 debye
